program: Gaussian 09
title: 000033335
version: EM64L-G09RevD.01
frameworkgroup: C1[X(C7H8O3)]
method: RPBEPBE
basis: SDD
operation: Freq
keyword: #p
keyword: freq=noraman
keyword: PBEPBE/SDD
title: #p freq=noraman PBEPBE/SDD
converged: YES YES NO NO
title: Mulliken charges:
elementType: O O O C C C C C C C H H H H H H H H
charge: -0.294975 -0.227651 -0.217824 -0.039702 -0.345366 -0.313815 0.312503 -0.369906 -0.254929 -0.180696 0.253896 0.224290 0.231144 0.231272 0.223607 0.255492 0.250999 0.261660
chargesum: 0.00000
title: Mulliken charges with hydrogens summed into heavy atoms:
elementType: O O O C C C C C C C
charge: -0.294975 -0.227651 -0.217824 0.214194 0.110069 0.141064 0.312503 -0.114413 -0.003930 0.080964
polarizability: 1.13410260e+02 -1.18617082e+00 7.39960246e+01 1.19564713e+00 3.33442456e-01 5.17874580e+01
1716.lowfreq: -11.2810 -6.8849 -3.3267 -0.0011 -0.0009 -0.0008 40.7997 49.8331 91.8011
frequency: 40.7384 49.7964 91.7819 109.0405 240.7768 280.5146 313.3059 406.9365 485.5343 584.4329 626.1956 670.9882 687.7173 756.2788 760.3250 799.1448 854.6489 861.9542 893.6880 902.6806 952.1253 982.7627 1006.0434 1028.5471 1044.4434 1097.6426 1114.9081 1132.4722 1142.4193 1207.7080 1214.9422 1231.2008 1241.8456 1347.8033 1367.7589 1418.3713 1472.1857 1484.2572 1505.4859 1571.4953 2976.0162 3040.6434 3073.8428 3121.1168 3184.2864 3221.2183 3241.4103 3277.9726
redmass: 5.1946 3.5747 3.6675 4.5437 3.9259 6.7188 7.0937 2.2160 5.0677 3.3706 3.8466 8.4250 1.3548 2.2874 2.1721 4.2740 1.3173 6.7655 1.3695 2.9006 2.7297 1.9172 2.8295 1.4005 2.1600 1.3637 1.3230 1.5325 1.5658 1.3293 1.6601 3.0074 1.6395 1.4811 2.3682 1.9667 1.1710 1.1676 5.4390 6.8506 1.0559 1.1076 1.0533 1.0921 1.1192 1.0920 1.1000 1.1070
irintensity: 0.6285 4.5893 3.7273 6.8677 10.5415 0.3672 4.9499 0.3330 13.7853 7.5543 9.0485 4.2481 80.2657 17.8801 51.3192 30.5534 1.5235 5.1460 7.6216 15.2841 36.8527 45.2522 61.1163 1.2030 20.6902 7.5736 11.7130 5.3872 5.7271 4.0025 41.5967 98.3078 29.9142 41.2523 8.1628 4.9115 14.3768 10.7179 83.5389 228.5331 28.3102 25.3983 22.1671 14.3395 27.0194 7.8172 2.0545 0.1837
temp: 298.150 k
press: 1.00000 atm
elementType: 8 8 8 6 6 6 6 6 6 6 1 1 1 1 1 1 1 1
symmnumber: 1
zpe: 359581.9 jmol-1
zpe.correction: 0.136958 hartree
zpe.thermalcorrener: 0.146268 hartree
zpe.thermalcorrenthalpy: 0.147212 hartree
zpe.thermalcorrgfe: 0.100859 hartree
zpe.sumelectzpe: -496.356836 hartree
zpe.sumelectthermal: -496.347525 hartree
zpe.sumelectthermalent: -496.346581 hartree
zpe.sumelectthermalfe: -496.392934 hartree
dipole: -0.5569 0.5759 0.5724
dipole: 0.9846
quadrupole: -57.2635 -58.4575 -58.0577
quadrupole: -8.4812 1.3704 0.0579
quadrupole: 0.6627 -0.5313 -0.1314 -8.4812 1.3704 0.0579
hfenergy: -496.4937931 hartree
pointgroup: C01 [X(C7H8O3)]
dipole: 0.2190619 0.18224 -0.2624007 debye
dipolederiv: -0.5552548 0.1115956 0.0550071 0.15344 -0.5327373 0.0089054 0.0779447 0.0045756 -0.2975263 -1.9750326 -0.021363 0.0863754 -0.0604833 -0.3503698 0.0356971 0.169951 0.0232732 -0.2600758 -0.5743619 -0.1151996 0.0585725 0.0876796 -0.5485123 0.1144397 0.0184197 0.1290666 -0.1624031 0.2915092 0.054989 -0.032972 -0.0044303 0.2084336 -0.0972926 -0.127335 -0.027905 0.2659529 0.1495584 -0.0212485 -0.1318717 0.0612153 0.2609966 0.037738 -0.0450723 -0.0346253 0.2065758 0.9632513 -0.11183 0.0654611 -0.5819438 0.3226784 0.0874686 0.081336 0.0518101 0.3066768 1.6463766 0.1344273 -0.1226529 0.4637227 0.5166385 -0.1373294 -0.2342605 -0.1191655 0.1803065 -0.372763 -0.0317527 0.0094451 -0.3063576 -0.2296293 -0.0022367 0.0880975 -0.0212554 -0.2959021 0.1763144 -0.0191888 -0.0224432 -0.1036796 -0.055992 -0.0319131 0.0015021 -0.0364165 -0.1854242 0.0704445 0.1546213 -0.0697529 0.2496156 0.1903345 -0.1238251 -0.0925511 -0.1188243 -0.1556867 0.0125362 -0.0192604 -0.0080807 -0.0387798 0.0738232 0.0592506 -0.0019391 0.0761933 -0.0787533 0.0947874 -0.0071034 0.0943134 -0.0323755 0.041363 -0.0083787 0.0687671 -0.0420683 -0.0941489 -0.0030801 -0.1120291 0.0400338 -0.1180599 -0.0461073 -0.0166624 0.0296145 0.0115959 0.0637292 -0.0344982 -0.0570514 -0.0670203 0.075433 -0.0659242 -0.0888888 -0.0257886 -0.1014755 -0.0030225 0.0051708 0.0101714 0.0176383 0.0944605 0.0294681 0.0322329 -0.0343111 0.076499 -0.1109215 0.0636785 0.0880621 -0.0117525 0.0982863 0.0399959 0.0471973 -0.0164498 0.0453639 0.2093998 0.0081017 -0.0706869 0.0334859 -0.0879724 0.0725886 0.0418729 0.0398309 0.0403439 0.1844806 0.0332616 0.0328471 0.0062139 0.0502294 0.072952 0.0417243 0.002244 0.0430144 0.2267426 unknown
polarizability: 113.427931|1.1767398|73.1763838|0.7439578|-4.1792417|52.5894282 unknown
InChI: InChI=1S/C7H8O3/c1-2-7(8-3-1)10-5-6-4-9-6/h1-3,6H,4-5H2
charge 0 multiplicity 1
18 atoms
O  -3.713113 0.698733 0.088443
O  -0.180682 -0.551502 0.368801
O  2.062951 -1.128079 0.360603
C  -2.528229 -0.103698 0.571508
C  -3.419723 -0.670123 -0.487163
C  -1.196564 0.51511 0.214518
C  1.110735 -0.129952 0.153269
C  1.709122 1.063639 -0.227996
C  3.137099 0.796205 -0.26154
C  3.321683 -0.525558 0.092615
H  -2.620691 -0.47759 1.598331
H  -3.080438 -0.667096 -1.530371
H  -4.145062 -1.446435 -0.218437
H  -0.952538 1.354964 0.895457
H  -1.203575 0.884209 -0.829844
H  1.215863 2.00449 -0.458544
H  3.920699 1.50597 -0.519917
H  4.179462 -1.180287 0.207366
