program: Gaussian 09
title: 000033412
version: EM64L-G09RevD.01
frameworkgroup: C1[X(C14H27N5)]
method: RPBEPBE
basis: SDD
operation: Freq
keyword: #pfreq=noraman
keyword: PBEPBE/SDD
title: #p freq=noraman PBEPBE/SDD
converged: YES YES NO NO
title: Mulliken charges:
elementType: N N N N N C C C C C C C C C C C C C C H H H H H H H H H H H H H H H H H H H H H H H H H H H
charge: -0.326788 -0.326734 -0.108305 -0.107829 -0.110514 -0.332058 -0.332715 -0.390081 -0.389925 -0.339335 -0.340000 -0.450729 0.052457 0.027809 0.027953 -0.365889 -0.692298 -0.692788 -0.685641 0.220681 0.188515 0.189627 0.224096 0.232610 0.210038 0.230620 0.209237 0.189986 0.195896 0.194320 0.190389 0.211265 0.212527 0.316856 0.317545 0.216491 0.215213 0.210050 0.216192 0.211460 0.211399 0.215966 0.211231 0.211817 0.211707 0.217674
chargesum: 0.00000
title: Mulliken charges with hydrogens summed into heavy atoms:
elementType: N N N N N C C C C C C C C C C C C C C
charge: -0.009931 -0.009188 -0.108305 -0.107829 -0.110514 0.077138 0.081008 0.052567 0.049932 0.046548 0.044709 -0.026937 0.052457 0.027809 0.027953 0.065815 -0.054596 -0.054191 -0.044442
polarizability: 2.43616788e+02 1.04566903e-01 2.04420021e+02 5.54339203e+00 7.13808539e-01 1.39185555e+02
1716.lowfreq: -11.7371 -7.6218 -5.7708 -0.0005 0.0003 0.0004 7.7462 18.9339 33.8430
frequency: -7.6211 18.3752 33.8223 34.0936 35.9858 58.4033 59.8986 72.5490 97.8022 103.7364 106.2421 151.4531 155.5612 159.9411 213.0683 213.7665 220.8376 228.8026 233.9769 240.8684 254.2736 269.8436 282.8950 345.1493 381.1281 418.2698 427.6269 531.6302 533.6377 543.7863 554.6779 573.0879 634.1219 639.5327 716.1106 717.0026 730.5354 736.2181 744.4735 785.8726 796.7165 810.3874 870.4924 882.5034 897.6543 898.4673 901.7812 915.1622 931.3992 948.8808 984.0757 1009.7556 1013.9291 1056.9077 1068.2414 1072.0320 1073.4898 1090.5666 1098.8829 1111.4011 1113.0573 1145.5283 1163.5328 1166.5138 1205.3286 1221.3622 1225.8006 1236.7273 1267.6566 1268.2057 1270.1579 1279.1952 1284.2733 1286.2509 1296.5628 1305.5985 1325.9561 1339.2379 1342.3956 1345.1943 1352.9859 1364.4788 1368.1351 1386.1853 1388.0666 1391.9704 1409.9227 1446.0531 1446.8908 1455.6090 1463.3180 1468.8322 1472.0105 1473.8230 1474.7326 1476.7417 1477.1786 1479.2136 1484.1629 1484.3894 1488.4250 1493.9554 1506.0334 1531.9401 1587.4303 2960.8275 2960.9975 2971.4731 2971.8171 2972.3638 2978.3152 2980.0151 2985.1264 2997.6766 2998.1803 3004.7259 3005.4598 3010.8280 3033.2181 3038.1967 3039.5206 3064.2259 3065.2071 3068.6752 3070.4596 3071.1381 3071.5726 3071.7975 3073.2757 3086.0674 3568.1708 3570.0664
redmass: 2.6854 2.8359 3.6978 4.0493 3.9382 1.5303 1.6615 1.8498 4.1693 2.5376 2.3160 5.3361 3.5875 3.0330 3.5096 3.4351 1.4973 1.1898 1.1757 1.6585 3.8235 2.8338 3.0140 4.3189 3.1469 2.9912 3.2371 4.4325 4.7177 1.4225 1.1656 2.5360 3.5781 3.2508 6.1477 11.1067 1.0946 1.1100 1.1187 1.2461 1.2446 11.1703 1.2869 2.1758 1.8093 2.0246 4.7674 1.3993 1.2374 4.9571 2.5534 4.1069 2.9891 2.9095 2.0904 2.4538 2.2132 2.1472 1.8746 2.3561 2.3194 3.2496 2.4727 2.1127 3.1713 1.4906 1.3964 1.6033 1.2901 1.3151 1.3461 1.1363 1.1362 1.1269 1.2761 1.1566 1.4783 1.7607 1.5003 1.5167 1.8310 1.4027 1.4092 1.2152 1.2118 1.2181 2.6029 1.1255 1.1715 1.1896 1.0719 1.0731 1.0647 1.0634 1.0478 1.0433 1.0658 1.0472 1.0769 1.0856 1.0799 2.7034 2.6154 5.4677 5.4294 1.0585 1.0587 1.0365 1.0368 1.0352 1.0600 1.0605 1.0595 1.0625 1.0645 1.0953 1.0958 1.0583 1.1010 1.1002 1.1004 1.1024 1.1019 1.1012 1.1021 1.0991 1.1003 1.1016 1.1023 1.1046 1.0770 1.0771
irintensity: 0.1686 0.0423 0.1212 0.0443 0.5382 0.0318 0.0110 0.0037 0.0411 0.0534 0.0434 0.0136 4.9457 4.7917 0.2988 0.0829 1.5134 0.0046 0.1330 1.2975 0.0476 0.0643 0.4617 2.0004 0.0114 5.6147 0.0351 14.7415 2.9777 144.6955 8.7547 54.8089 6.4824 0.8827 18.8204 0.5871 21.9861 0.0447 6.6346 0.5521 0.3087 23.4904 6.4113 3.9507 1.8196 1.5069 22.7010 6.0012 0.9589 0.4353 0.5210 4.4609 1.8111 0.4965 4.4822 0.4252 0.1848 40.2449 21.5201 9.3788 26.0162 0.6795 14.0952 2.2938 7.1163 1.6638 7.5714 7.3015 0.7821 1.1560 1.2430 3.9975 0.6106 1.0972 6.4854 30.3826 9.5021 2.4404 2.4829 2.5047 7.9189 52.2909 27.5252 6.1141 7.5013 17.4386 206.5558 67.4051 12.8823 30.0096 1.3194 1.3702 0.0708 2.3862 24.1309 8.5684 11.4345 1.2834 12.7438 0.5420 22.7423 269.0105 8.4850 1081.8529 365.2970 6.0340 51.0114 36.4257 26.1799 45.8588 29.0472 26.9575 14.5575 48.5495 82.8137 9.9147 14.3478 35.4082 0.9546 18.3276 5.4389 17.1789 17.8493 23.2731 134.4311 47.2828 73.2346 91.0253 30.1955 56.7506 76.6174 31.8376
temp: 298.150 k
press: 1.00000 atm
elementType: 7 7 7 7 7 6 6 6 6 6 6 6 6 6 6 6 6 6 6 1 1 1 1 1 1 1 1 1 1 1 1 1 1 1 1 1 1 1 1 1 1 1 1 1 1 1
symmnumber: 1
zpe: 1057751.3 jmol-1
zpe.correction: 0.402876 hartree
zpe.thermalcorrener: 0.424649 hartree
zpe.thermalcorrenthalpy: 0.425593 hartree
zpe.thermalcorrgfe: 0.349358 hartree
zpe.sumelectzpe: -821.970965 hartree
zpe.sumelectthermal: -821.949193 hartree
zpe.sumelectthermalent: -821.948248 hartree
zpe.sumelectthermalfe: -822.024483 hartree
dipole: -2.6398 0.0323 0.1462
dipole: 2.6440
quadrupole: -118.0830 -104.0965 -119.7824
quadrupole: 0.1520 3.3314 0.1837
quadrupole: -4.0957 9.8908 -5.7951 0.1520 3.3314 0.1837
hfenergy: -822.3738414 hartree
pointgroup: C01 [X(C14H27N5)]
dipole: 1.0331873 0.0005717 0.1208344 debye
polarizability: 243.8931659|0.6459131|204.425754|0.8712937|-0.8710917|138.9034439 unknown
InChI: InChI=1S/C14H27N5/c1-4-7-10-15-13-17-12(9-6-3)18-14(19-13)16-11-8-5-2/h15-16H,4-11H2,1-3H3
charge 0 multiplicity 1
46 atoms
N  -0.11083 2.315124 -1.039045
N  -0.113477 -2.390948 -0.938641
N  -2.146186 -1.2465 -0.780157
N  -2.144999 1.180706 -0.834995
N  -0.025905 -0.03806 -0.984465
C  2.050984 2.380409 0.263442
C  2.083376 -2.331224 0.308078
C  1.351119 2.444634 -1.115759
C  1.346882 -2.524887 -1.039527
C  3.58901 2.465157 0.142299
C  3.616819 -2.441688 0.154406
C  -4.271901 -0.027382 -0.570937
C  -2.773201 -0.031292 -0.752399
C  -0.767129 1.114473 -0.949934
C  -0.768604 -1.18719 -0.899517
C  -4.662002 -0.034529 0.934544
C  4.299903 2.385869 1.510472
C  4.366965 -2.193522 1.481098
C  -6.191569 -0.033705 1.138401
H  1.766986 1.428018 0.75135
H  1.678596 3.201003 0.909587
H  1.722905 -3.080144 1.041772
H  1.818869 -1.332121 0.703996
H  1.732262 1.625078 -1.750989
H  1.584522 3.403089 -1.617737
H  1.712104 -1.769191 -1.758755
H  1.568889 -3.526364 -1.454797
H  3.870265 3.410626 -0.366259
H  3.947899 1.641508 -0.508702
H  3.959454 -1.708969 -0.605113
H  3.88039 -3.445445 -0.23857
H  -4.693507 -0.923963 -1.059623
H  -4.687251 0.875946 -1.051928
H  -0.707228 3.141102 -0.975462
H  -0.710316 -3.213267 -0.84229
H  -4.216479 -0.927775 1.413473
H  -4.214805 0.852633 1.423375
H  4.065136 1.433413 2.022899
H  5.398194 2.448615 1.400847
H  3.977863 3.210439 2.173942
H  4.058818 -2.921984 2.254569
H  5.461343 -2.280611 1.350744
H  4.151941 -1.180194 1.870482
H  -6.653146 0.862921 0.683463
H  -6.65513 -0.923942 0.673019
H  -6.451531 -0.039664 2.213041
