program: Gaussian 09
title: 000033267
version: EM64L-G09RevD.01
frameworkgroup: C1[X(C11H12N2O)]
method: RPBEPBE
basis: SDD
operation: Freq
keyword: #p
keyword: freq=noraman
keyword: PBEPBE/SDD
title: #p freq=noraman PBEPBE/SDD
converged: NO NO NO NO
title: Mulliken charges:
elementType: O N N C C C C C C C C C C C H H H H H H H H H H H H
charge: -0.246909 -0.300261 -0.057102 0.053476 -0.321468 0.215791 -0.418605 0.036511 -0.092850 -0.295532 -0.668361 -0.324819 -0.283311 -0.180591 0.235464 0.235099 0.348902 0.222971 0.222555 0.233942 0.214727 0.214805 0.233671 0.261263 0.231338 0.229293
chargesum: 0.00000
title: Mulliken charges with hydrogens summed into heavy atoms:
elementType: O N N C C C C C C C C C C C
charge: -0.246909 0.048640 -0.057102 0.053476 0.149095 0.215791 0.026921 0.036511 -0.092850 -0.061590 -0.005158 -0.063556 -0.051972 0.048702
polarizability: 2.03873687e+02 2.16863031e+01 1.72243732e+02 2.08342114e-01 -6.04826417e-02 6.66420015e+01
1716.lowfreq: -0.0002 0.0005 0.0009 2.4418 5.8613 7.1901 28.9880 57.2905 64.9839
frequency: 28.8292 57.0289 64.8951 115.8715 135.0622 190.6646 212.9063 223.9468 241.1917 266.0665 342.8850 386.1232 407.1529 474.4885 491.4192 537.5365 559.3373 637.3299 655.6727 713.0746 717.2891 750.2958 755.8498 776.9621 804.8336 862.2909 867.3261 879.8327 884.2233 945.5925 946.2541 988.7536 1002.1236 1016.3217 1066.7430 1098.0036 1128.1053 1136.0856 1143.9941 1155.2690 1192.8177 1241.2147 1249.3361 1284.7978 1294.3972 1311.5826 1350.5063 1365.2519 1392.1133 1398.8025 1442.7512 1471.0507 1476.0828 1480.7572 1487.5330 1498.1595 1521.6794 1601.9541 1628.7591 1672.7415 2967.4872 2982.8621 2986.0714 3012.8898 3043.6356 3079.6052 3090.6723 3127.2897 3133.0576 3163.6365 3173.6090 3330.7792
redmass: 2.5520 1.9466 4.2647 3.8428 5.9308 3.2351 3.3369 1.1092 5.9672 6.3251 5.2617 3.5002 3.3738 9.0566 3.5226 4.0201 6.4927 7.7491 8.6430 5.9301 3.1743 1.1236 1.4844 3.9483 1.2756 7.1260 1.5201 2.6774 1.1748 2.6914 1.3626 1.3475 2.1666 4.7071 2.8296 2.7344 4.3500 2.3184 1.5514 1.4657 1.6653 1.2266 3.2437 1.5145 1.0791 1.4316 2.7727 1.6267 1.4723 1.5931 2.1367 1.0830 1.0546 1.0413 1.0881 2.5603 4.9745 6.0557 9.4631 10.4223 1.0584 1.0386 1.0569 1.1025 1.1039 1.1016 1.0992 1.0860 1.0904 1.0950 1.0980 1.0745
irintensity: 1.1605 0.5761 1.0129 2.5221 1.2251 1.5533 1.6522 0.2595 5.6428 0.0201 0.7994 0.1954 2.4017 18.9168 28.5912 2.4396 6.6347 2.1600 7.0573 30.4922 2.9428 32.9905 33.6416 11.6989 72.2216 1.6953 6.9724 5.0519 2.7766 32.8155 0.8176 1.5203 9.9105 31.0481 17.8240 21.3796 20.9040 24.3781 0.1430 73.2637 3.2215 0.4846 142.1096 54.2603 0.4761 20.2108 10.5948 48.4671 107.6595 56.9509 83.7089 26.9125 1.3389 15.3658 34.0707 26.5297 210.1021 248.7763 148.0210 474.7655 5.4740 18.4230 37.6238 4.3173 14.7373 62.0428 36.7017 3.5645 16.6183 20.2294 17.5076 62.3123
temp: 298.150 k
press: 1.00000 atm
elementType: 8 7 7 6 6 6 6 6 6 6 6 6 6 6 1 1 1 1 1 1 1 1 1 1 1 1
symmnumber: 1
zpe: 545027.7 jmol-1
zpe.correction: 0.207590 hartree
zpe.thermalcorrener: 0.220325 hartree
zpe.thermalcorrenthalpy: 0.221269 hartree
zpe.thermalcorrgfe: 0.167168 hartree
zpe.sumelectzpe: -610.064015 hartree
zpe.sumelectthermal: -610.051280 hartree
zpe.sumelectthermalent: -610.050336 hartree
zpe.sumelectthermalfe: -610.104437 hartree
dipole: 5.3213 -6.9399 0.0130
dipole: 8.7452
quadrupole: -66.7604 -97.2716 -84.7123
quadrupole: 8.5767 0.0225 0.0048
quadrupole: 16.1544 -14.3568 -1.7975 8.5767 0.0225 0.0048
hfenergy: -610.2716051 hartree
pointgroup: C01 [X(C11H12N2O1)]
dipole: -2.1530951 2.6836792 -0.0041331 debye
dipolederiv: -0.6199519 -0.5980985 0.0011835 -0.2259543 -1.146447 0.0016948 0.0009344 0.0025227 -0.344534 -1.5890156 0.0993933 -0.0003104 -0.1052197 -0.1826483 -0.0004106 -0.0043028 0.0000458 -0.2716397 -0.6268547 -0.9977779 0.0019893 -0.1769373 -1.3784493 0.0019246 0.0005213 0.0028391 -0.3095814 1.5635402 0.2669449 -0.0010853 1.1622452 -0.0668488 0.0001944 -0.0017287 -0.0001887 0.1959037 0.5246329 -0.102078 -0.0007494 -0.3202244 0.225691 0.0004722 0.0029956 0.0003198 0.3045176 -0.9678728 0.3612059 -0.0001289 -1.024006 -0.3802773 0.0010433 0.0025917 0.0002085 -0.1006898 0.0693366 0.0482529 -0.0007044 0.1280337 0.0519579 -0.0008345 -0.0003767 -0.0008267 0.1568649 0.3347341 0.5117091 -0.000855 -0.0720278 1.6743275 -0.002581 -0.0000005 -0.0030736 0.0796543 1.1045458 1.0436482 -0.0028878 0.1929979 1.0908166 -0.0020957 -0.0019948 -0.0031433 0.1391781 0.4326484 -0.0703468 -0.0005749 0.774803 0.1500516 -0.0004818 -0.0017833 -0.0001034 -0.0741868 -0.0591535 0.0410915 -0.000734 -0.0102435 0.0313671 0.0000805 -0.0009583 0.0003123 0.0944267 0.0720628 -0.62845 0.0005924 -0.0895287 -0.8281218 0.0009741 -0.0000575 0.0013407 -0.1948446 -0.9065473 0.2334612 0.0001376 -0.0565641 -0.0173417 -0.0000334 0.001046 -0.0004379 -0.2329712 0.4860104 -0.1986263 -0.0003196 -0.2947776 0.6211902 -0.0006956 -0.0006597 -0.0005151 -0.0787582 -0.0280502 -0.0233458 -0.0486746 0.0671919 -0.0086668 -0.0743596 -0.0227465 -0.0833229 -0.0469824 -0.0280315 -0.0256119 0.0503209 0.0631353 -0.0097239 0.074243 0.0231526 0.0828088 -0.0437054 0.2312394 0.0497418 0.0001672 0.0460262 0.1726933 0.0001026 0.000734 0.0001577 0.2613731 0.0463885 0.0159528 -0.0006212 -0.0330247 -0.0197481 -0.1089535 -0.0134494 -0.1207283 -0.0626101 0.0455672 0.0141437 0.0021964 -0.0348332 -0.0219685 0.109277 0.0147231 0.1217109 -0.0605043 -0.0440253 0.1128367 0.0002768 0.0785835 0.0264059 -0.0000094 0.0003249 0.0000756 0.1377729 0.096886 -0.0278712 -0.0587796 0.0219621 -0.008954 -0.1028512 -0.0213502 -0.1216686 -0.0768432 0.09571 -0.0301443 0.0610287 0.0202663 -0.0104268 0.1034899 0.0240417 0.1215697 -0.0738432 -0.19366 -0.0344126 -0.002165 -0.0612646 0.0630726 -0.0006974 -0.0024241 -0.0004526 0.110552 -0.0356026 0.0330119 0.0001989 0.0824624 0.0505841 0.0000591 0.0001375 0.0001569 0.1689132 0.0720935 0.0058286 0.0001189 -0.0221061 -0.1260578 0.000235 0.0002627 0.0001189 0.1777901 -0.0766303 -0.1004593 0.0003793 -0.1109958 0.0475225 0.0002132 0.000367 0.0002737 0.1447475 unknown
polarizability: 202.9050676|22.3605413|173.2124594|-0.0858538|-0.171225|66.6418939 unknown
InChI: InChI=1S/C11H12N2O/c1-2-7-12-10-8-5-3-4-6-9(8)13-11(10)14/h3-6,12H,2,7H2,1H3
charge 0 multiplicity 1
26 atoms
O  -0.214124 -3.044727 0.009042
N  -1.629117 -0.617518 0.00535
N  1.825305 -1.741272 0.004009
C  -0.299282 -0.577767 0.004633
C  -2.561065 0.529182 0.003647
C  0.700327 0.420332 0.001954
C  -4.025631 0.054873 -0.011043
C  1.960398 -0.354965 0.001623
C  0.466297 -1.971751 0.005798
C  0.704234 1.847668 0.000817
C  -5.007839 1.24518 -0.014397
C  3.189267 0.363709 -0.0007
C  1.932849 2.518589 -0.001328
C  3.158855 1.76833 -0.002242
H  -2.365731 1.150443 0.901069
H  -2.350532 1.159206 -0.884012
H  -2.010179 -1.582064 0.007911
H  -4.198115 -0.574238 -0.90625
H  -4.213659 -0.581954 0.87561
H  -0.23357 2.415614 0.002049
H  -4.874442 1.87693 0.883282
H  -4.860726 1.882977 -0.905602
H  -6.052954 0.890612 -0.023558
H  4.133556 -0.188397 -0.001087
H  1.968134 3.612336 -0.00209
H  4.108145 2.317974 -0.003983
