program: Gaussian 09
title: 000033294
version: EM64L-G09RevD.01
frameworkgroup: C1[X(C13H21O3PS)]
method: RPBEPBE
basis: SDD
operation: Freq
keyword: #p
keyword: freq=noraman
keyword: PBEPBE/SDD
title: #p freq=noraman PBEPBE/SDD
converged: YES YES NO NO
title: Mulliken charges:
elementType: S P O O O C C C C C C C C C C C C C H H H H H H H H H H H H H H H H H H H H H
charge: 0.020253 1.037117 -0.524082 -0.514502 -0.599712 0.035543 0.041474 -0.812751 -0.668254 -0.665179 -0.665638 -0.673259 0.491015 -0.363322 -0.375765 -0.218154 -0.217636 -0.234211 0.217380 0.224321 0.302221 0.296399 0.207063 0.270873 0.213599 0.209600 0.221967 0.226180 0.204435 0.259587 0.225510 0.206300 0.232760 0.227937 0.232168 0.240093 0.228115 0.229356 0.231203
chargesum: 0.00000
title: Mulliken charges with hydrogens summed into heavy atoms:
elementType: S P O O O C C C C C C C C C C C C C
charge: 0.020253 1.037117 -0.524082 -0.514502 -0.599712 0.252923 0.265795 -0.214132 0.023281 -0.007432 0.023893 -0.006263 0.491015 -0.131154 -0.135672 0.009961 0.011720 -0.003009
polarizability: 2.81825172e+02 1.56846666e+00 1.92010967e+02 3.50265668e+00 -3.81980551e+00 1.41499770e+02
1716.lowfreq: -19.1705 -0.0024 -0.0018 0.0013 1.6042 6.7417 10.7317 16.1461 21.6268
frequency: -16.5002 15.5028 21.5582 32.5946 35.5090 42.8749 61.9124 82.7337 91.6692 116.0480 133.9534 183.0449 189.3186 196.9441 205.9286 224.6249 235.0204 244.9005 268.0841 273.0064 296.9902 329.7566 331.8308 347.7126 383.7102 401.4408 435.0311 445.0041 459.6523 467.4061 496.7568 549.0138 616.2583 621.1918 641.9905 661.3853 700.9515 775.0861 805.6093 815.4802 819.9332 851.6258 895.9327 900.1646 909.0600 926.5163 927.5656 928.9703 935.9439 938.1066 977.4728 989.7654 997.7405 1024.8913 1026.3258 1077.0958 1092.8911 1100.5909 1133.2731 1151.7765 1153.7799 1173.5305 1180.1256 1180.5074 1187.8023 1221.4875 1246.2805 1301.9336 1325.3086 1326.6516 1337.8804 1339.2988 1378.8011 1381.6892 1385.7169 1393.5118 1397.2257 1440.6811 1452.9283 1454.4796 1463.4566 1463.9046 1465.9718 1468.5614 1470.9359 1483.3184 1486.0081 1489.6245 1592.8243 1612.5606 2981.5350 2983.9550 2985.7117 2989.8751 2992.3718 3003.7105 3050.1212 3080.9325 3082.7306 3090.4602 3091.8583 3096.1465 3097.7318 3101.0251 3104.9917 3121.4312 3125.5628 3131.7661 3137.6161 3149.7369 3166.0847
redmass: 2.6921 4.3693 3.7496 3.0675 4.1389 3.3062 4.0298 5.7593 6.2627 5.6497 5.1327 5.0400 1.0546 3.3522 1.1167 1.4986 3.9104 1.6557 2.4036 2.5884 4.2190 2.7137 3.4332 2.6932 2.8906 2.7966 3.2017 2.9658 3.7978 3.9240 8.6167 5.9533 6.2730 4.7524 5.0626 4.8389 1.6812 2.0818 4.0888 5.5972 4.5344 1.2496 1.5023 2.9334 2.8429 1.4162 1.2413 1.2151 1.3629 1.3932 1.3916 6.0313 1.3310 13.1535 2.2655 1.5210 1.6224 1.6795 1.0723 2.1078 2.0636 1.0528 1.9390 1.9341 1.1104 2.6397 1.2419 1.1940 1.2859 1.3290 1.3396 1.4024 1.2543 1.2628 8.5868 1.2206 1.2150 2.2015 1.0497 1.0511 1.0892 1.0599 1.0532 1.0513 1.0532 2.3314 1.0500 1.0479 6.0596 6.1141 1.0837 1.0367 1.0360 1.0366 1.0356 1.0864 1.0582 1.0991 1.0988 1.0992 1.0990 1.1008 1.1009 1.1010 1.1007 1.0867 1.0876 1.1083 1.0919 1.0964 1.1017
irintensity: 0.3939 0.1284 0.0531 0.6122 0.4342 0.7651 1.7918 0.2245 0.9056 2.0623 2.9521 0.9872 0.1061 10.0499 0.3717 4.2203 0.7980 5.6806 0.5880 7.0306 4.3839 0.5360 1.7422 8.9682 10.7145 0.0309 4.4309 11.0818 22.0123 3.4625 158.1432 17.2927 0.8528 44.6934 52.1731 71.1278 56.5913 30.7882 6.8473 291.3718 140.2042 0.0781 0.7424 105.7880 70.3580 2.2098 1.0714 1.4225 0.3845 0.0514 0.0473 0.5043 0.0339 82.3762 14.5893 10.9295 114.9164 78.1798 0.5251 11.5301 16.4413 0.0109 20.5925 16.1608 0.9057 4.8045 11.8598 22.6327 5.8331 9.4904 12.8917 5.3100 27.0143 39.4619 0.2297 33.1646 30.2700 9.0407 5.0074 11.3743 13.2222 3.4898 0.8372 6.9798 3.2533 11.0131 12.7593 20.0344 0.8643 0.2682 14.1269 21.1371 19.8877 21.4777 21.6783 14.8390 6.6249 11.1863 9.9725 47.3887 39.5335 18.2148 16.0240 26.9494 34.6459 7.0305 1.0656 1.6604 13.0030 37.9108 26.2087
temp: 298.150 k
press: 1.00000 atm
elementType: 16 15 8 8 8 6 6 6 6 6 6 6 6 6 6 6 6 6 1 1 1 1 1 1 1 1 1 1 1 1 1 1 1 1 1 1 1 1 1
symmnumber: 1
zpe: 829402.5 jmol-1
zpe.correction: 0.315903 hartree
zpe.thermalcorrener: 0.337248 hartree
zpe.thermalcorrenthalpy: 0.338192 hartree
zpe.thermalcorrgfe: 0.262444 hartree
zpe.sumelectzpe: -1471.538311 hartree
zpe.sumelectthermal: -1471.516966 hartree
zpe.sumelectthermalent: -1471.516021 hartree
zpe.sumelectthermalfe: -1471.591770 hartree
dipole: -0.9237 0.7321 -4.0096
dipole: 4.1792
quadrupole: -110.2661 -109.6689 -135.2017
quadrupole: -1.2316 -8.8886 -0.3645
quadrupole: 8.1128 8.7100 -16.8228 -1.2316 -8.8886 -0.3645
hfenergy: -1471.8542134 hartree
pointgroup: C01 [X(C13H21O3P1S1)]
dipole: -0.2561652 0.2243409 -1.6085859 debye
polarizability: 280.2828161|5.5809034|191.9958843|13.7639746|-4.8494712|143.0572086 unknown
InChI: InChI=1S/C13H21O3PS/c1-11(2)15-17(14,16-12(3)4)18-10-13-8-6-5-7-9-13/h5-9,11-12H,10H2,1-4H3
charge 0 multiplicity 1
39 atoms
S  -0.478558 -0.11961 1.592968
P  1.739778 0.074203 1.12876
O  1.833912 1.150736 -0.244689
O  2.016033 -1.407982 0.28987
O  2.665856 0.468258 2.364202
C  1.884891 2.636107 0.009712
C  3.356986 -1.652367 -0.369316
C  -1.074645 -0.565823 -0.197479
C  3.319302 3.055009 0.361184
C  1.349569 3.267952 -1.278184
C  4.415234 -1.971571 0.696061
C  3.086949 -2.802903 -1.34082
C  -2.576053 -0.446637 -0.246047
C  -3.193817 0.796685 -0.544387
C  -3.397084 -1.576874 0.005747
C  -4.600017 0.905961 -0.599519
C  -4.804511 -1.469391 -0.048053
C  -5.409741 -0.227794 -0.351617
H  1.205468 2.860294 0.85821
H  3.62339 -0.73068 -0.923632
H  -0.714504 -1.586677 -0.388137
H  -0.565405 0.142747 -0.868822
H  3.366305 4.149913 0.510291
H  3.652457 2.559564 1.288729
H  4.008767 2.786293 -0.459254
H  1.341349 4.369374 -1.184598
H  0.3216 2.924681 -1.487259
H  1.991461 2.994396 -2.133851
H  5.387827 -2.173891 0.209618
H  4.542799 -1.130219 1.398932
H  4.120422 -2.864995 1.27401
H  4.012367 -3.055264 -1.8905
H  2.307488 -2.524061 -2.069718
H  2.751418 -3.698356 -0.789174
H  -2.567296 1.677368 -0.731607
H  -2.92918 -2.53987 0.242861
H  -5.064596 1.869874 -0.835283
H  -5.426829 -2.350271 0.14467
H  -6.501392 -0.143877 -0.39478
