program: Gaussian 09
title: 000033273
version: EM64L-G09RevD.01
frameworkgroup: C1[X(C11H14N2)]
method: RPBEPBE
basis: SDD
operation: Freq
keyword: #pfreq=noraman
keyword: PBEPBE/SDD
title: #p freq=noraman PBEPBE/SDD
converged: YES YES NO NO
title: Mulliken charges:
elementType: N N C C C C C C C C C C C H H H H H H H H H H H H H H
charge: -0.439172 -0.107322 -0.487634 0.228356 -0.570155 -0.375140 -0.479069 0.507410 -0.416572 -0.394380 -0.225695 -0.229210 -0.242778 0.218551 0.254398 0.208311 0.232218 0.223643 0.217189 0.226870 0.225025 0.286073 0.226888 0.237648 0.222811 0.224456 0.227281
chargesum: 0.00000
title: Mulliken charges with hydrogens summed into heavy atoms:
elementType: N N C C C C C C C C C C C
charge: -0.153099 -0.107322 -0.014686 0.228356 -0.129627 0.065692 -0.027173 0.507410 -0.189684 -0.156731 -0.002884 -0.004753 -0.015497
polarizability: 1.77076297e+02 -2.41107955e+00 1.28813091e+02 1.22160921e+01 -1.73397955e+00 7.47873127e+01
1716.lowfreq: -21.6012 -0.0004 0.0004 0.0005 3.0005 5.0644 20.3654 32.5342 42.4535
frequency: 19.9629 29.0305 42.0667 64.0789 109.0480 128.7678 242.1635 290.7588 309.9516 348.1683 370.6227 403.5797 493.0621 552.5911 615.9301 617.7057 703.0999 713.3732 725.5929 761.7652 771.4944 825.7758 834.0815 854.0061 895.4866 917.6250 920.8648 954.7309 975.9626 989.8382 992.6490 1000.0501 1017.2983 1026.9488 1044.1243 1078.2091 1084.9351 1137.3954 1166.7656 1171.7660 1186.9302 1208.9139 1216.6035 1241.1049 1262.1529 1267.7317 1283.9108 1303.9438 1327.1480 1329.9332 1382.0351 1438.1554 1440.2257 1461.4229 1469.3324 1481.3542 1484.0777 1503.8418 1592.9251 1602.8729 1614.3342 2962.0508 2989.4036 2996.3773 2996.8593 3031.7911 3048.6599 3061.9664 3088.3670 3111.7342 3116.0759 3130.9036 3142.6391 3161.5946 3591.3654
redmass: 3.5030 3.1688 3.2449 3.9187 2.4872 3.9047 4.3224 2.7656 2.4194 1.4152 1.9988 2.8189 3.2813 5.0782 4.0411 6.2429 2.2842 2.5864 4.0782 2.0809 1.2647 1.9790 2.0436 1.2475 4.3171 1.7606 2.5407 2.7235 1.3882 6.2177 1.4691 2.5984 2.7534 2.1869 3.4551 1.6069 1.6117 1.1970 1.1361 1.0519 1.1161 1.1104 2.3324 1.4280 1.3757 1.3621 1.2844 1.4070 1.2808 1.4819 7.9857 2.2816 2.1862 1.0983 1.0995 1.1639 2.0964 1.1327 6.0607 6.7598 6.1752 1.0641 1.0621 1.0632 1.0666 1.0959 1.1003 1.1041 1.0986 1.0872 1.0868 1.0907 1.0958 1.1015 1.0796
irintensity: 4.3128 0.0613 1.9517 1.2347 1.5506 0.1066 3.5811 31.4247 22.2439 91.3281 19.1165 0.0124 12.6199 5.9284 3.1597 0.2424 32.0518 21.0003 8.8100 39.4005 0.8108 1.5326 3.5092 0.0324 2.1863 7.3987 26.7390 1.8171 0.0027 0.0730 0.2463 2.0910 6.3892 7.7190 13.7373 3.1723 9.0393 1.5247 1.9998 0.0519 0.1208 0.4420 0.1427 9.1145 7.0712 46.9093 25.3057 4.1424 0.7489 1.6748 0.0846 83.5508 20.2068 3.3097 1.2882 19.6971 15.1316 13.8907 2.8089 109.7950 12.5138 84.0082 5.0011 55.6830 44.0411 45.0304 9.7112 51.4909 14.5581 11.3419 6.4687 10.3806 45.2344 24.9128 11.6378
temp: 298.150 k
press: 1.00000 atm
elementType: 7 7 6 6 6 6 6 6 6 6 6 6 6 1 1 1 1 1 1 1 1 1 1 1 1 1 1
symmnumber: 1
zpe: 596518.3 jmol-1
zpe.correction: 0.227202 hartree
zpe.thermalcorrener: 0.239391 hartree
zpe.thermalcorrenthalpy: 0.240335 hartree
zpe.thermalcorrgfe: 0.185746 hartree
zpe.sumelectzpe: -536.101528 hartree
zpe.sumelectthermal: -536.089338 hartree
zpe.sumelectthermalent: -536.088394 hartree
zpe.sumelectthermalfe: -536.142983 hartree
dipole: 0.4709 3.1106 0.1318
dipole: 3.1488
quadrupole: -67.2402 -74.2270 -81.3607
quadrupole: 8.7079 3.2914 -2.6843
quadrupole: 7.0357 0.0490 -7.0847 8.7079 3.2914 -2.6843
hfenergy: -536.3287294 hartree
pointgroup: C01 [X(C11H14N2)]
dipole: 0.1881759 1.216331 0.1409544 debye
polarizability: 176.8509581|-3.4587877|128.8060455|12.8512482|2.0767713|75.0196967 unknown
InChI: InChI=1S/C11H14N2/c1-2-4-10(5-3-1)6-7-11-12-8-9-13-11/h1-5,12H,6-9H2
charge 0 multiplicity 1
27 atoms
N  2.933974 1.069655 0.101633
N  3.016773 -1.183804 -0.365919
C  0.792026 -0.070643 -0.611509
C  2.270591 -0.096601 -0.313987
C  -0.075388 0.084761 0.679465
C  4.384556 0.797512 0.22581
C  4.39967 -0.772021 0.068417
C  -1.563386 0.060074 0.364731
C  -2.291783 1.263329 0.17912
C  -2.248021 -1.173651 0.209513
C  -3.66563 1.23777 -0.15353
C  -3.620984 -1.205182 -0.121802
C  -4.335446 0.001929 -0.306056
H  0.550852 0.753641 -1.311351
H  0.537148 -1.018557 -1.113228
H  0.192774 1.029768 1.18851
H  0.190055 -0.739638 1.367253
H  4.782752 1.128092 1.201913
H  4.961361 1.300339 -0.577183
H  5.141572 -1.111763 -0.674874
H  4.633505 -1.270024 1.028353
H  2.550215 2.00745 0.000124
H  -1.780653 2.226838 0.303133
H  -1.700864 -2.113703 0.355235
H  -4.212839 2.17788 -0.288811
H  -4.133978 -2.167436 -0.232479
H  -5.40095 -0.020615 -0.561082
