program: Gaussian 09
title: 000033264
version: EM64L-G09RevD.01
frameworkgroup: C1[X(C3H3Cl3S3)]
method: RPBEPBE
basis: SDD
operation: Freq
keyword: #p
keyword: freq=noraman
keyword: PBEPBE/SDD
title: #p freq=noraman PBEPBE/SDD
converged: YES YES NO NO
title: Mulliken charges:
elementType: Cl Cl Cl S S S C C C H H H
charge: 0.158340 0.158458 0.122723 0.436658 0.369479 0.207998 -0.707098 -0.731197 -0.856403 0.285264 0.285378 0.270399
chargesum: 0.00000
title: Mulliken charges with hydrogens summed into heavy atoms:
elementType: Cl Cl Cl S S S C C C
charge: 0.158340 0.158458 0.122723 0.436658 0.369479 0.207998 -0.707098 -0.731197 -0.015362
polarizability: 1.45688766e+02 -6.20476677e+00 1.36885213e+02 -6.25281920e-02 -3.72021510e-02 7.20064979e+01
1716.lowfreq: -6.1423 -0.0025 -0.0010 0.0019 5.3909 7.0557 30.3804 65.2690 83.0754
frequency: 30.1595 65.2645 83.0727 95.8008 151.4488 176.4611 183.9932 203.4163 247.1350 260.6743 282.6816 308.1512 341.5148 426.9794 439.5920 443.7273 627.6603 651.1847 675.7075 681.7581 744.6479 958.9418 974.1332 1048.3654 1340.9918 1446.4231 1449.3936 3017.4065 3141.4822 3147.4083
redmass: 9.0407 8.2173 8.3167 17.5180 5.3726 29.1985 1.2401 5.2420 14.1030 8.4826 28.0754 13.4706 24.7146 28.0151 12.8189 27.3269 7.4263 12.7678 13.1532 13.3874 10.1930 1.1801 1.3562 7.9697 1.1271 1.0511 1.0520 1.0281 1.1033 1.1066
irintensity: 0.7933 0.9921 0.8356 0.8037 0.1861 0.2767 0.0059 0.0609 0.0855 4.5024 0.0010 0.0686 1.9775 11.7834 2.6138 8.5945 8.9561 234.5560 203.7519 170.7788 20.0155 5.9570 21.7952 151.0972 2.3211 21.2016 30.6627 7.0154 5.1766 6.8251
temp: 298.150 k
press: 1.00000 atm
elementType: 17 17 17 16 16 16 6 6 6 1 1 1
symmnumber: 1
zpe: 141432.0 jmol-1
zpe.correction: 0.053869 hartree
zpe.thermalcorrener: 0.066038 hartree
zpe.thermalcorrenthalpy: 0.066983 hartree
zpe.thermalcorrgfe: 0.013124 hartree
zpe.sumelectzpe: -2689.737355 hartree
zpe.sumelectthermal: -2689.725185 hartree
zpe.sumelectthermalent: -2689.724241 hartree
zpe.sumelectthermalfe: -2689.778099 hartree
dipole: -1.8513 3.0728 0.0029
dipole: 3.5874
quadrupole: -90.9405 -93.5837 -95.8423
quadrupole: -9.2493 -0.0055 0.0047
quadrupole: 2.5150 -0.1282 -2.3868 -9.2493 -0.0055 0.0047
hfenergy: -2689.7912232 hartree
pointgroup: C01 [X(C3H3Cl3S3)]
dipole: -0.8415366 0.9161099 -0.6667581 debye
dipolederiv: -0.2752069 0.1298845 0.0948805 0.2656311 -0.6336183 -0.2959302 0.0665213 -0.2380233 -0.2172405 -0.308318 -0.0632964 -0.1812957 -0.000388 -0.1150089 -0.105108 -0.3106464 -0.1525066 -0.7038038 -0.4563657 -0.2679437 0.2275814 -0.2134938 -0.4025046 0.2110432 0.1845311 0.2138651 -0.3276989 -0.7852236 -0.1864025 0.1858404 -0.2893243 -0.3110911 0.2228603 0.2672444 0.2174929 -0.2314578 -0.609592 0.245391 -0.1557381 0.1132003 0.0236254 -0.00269 -0.0527763 -0.0102726 0.0381939 -0.2665522 0.2106811 -0.1491816 0.081939 -0.4898327 0.3864262 -0.0481604 0.3798572 -0.283832 1.4501316 0.234484 -0.1842517 -0.1839044 1.180825 0.2302958 0.1450572 0.2076541 1.291659 1.2279421 -0.2551024 0.1161023 0.1888299 0.6420776 -0.7065541 -0.2318964 -0.6822929 0.2983788 -0.1198969 -0.0151344 0.0211922 -0.0112833 0.0360885 0.0132455 0.0186791 0.0131636 0.0412841 0.1177752 0.0099165 0.0895853 0.0493059 0.018019 0.0204963 0.0507101 0.0022037 -0.0482406 0.1034363 -0.0924191 -0.0384561 -0.0466348 -0.0421276 -0.00999 -0.0660756 0.0132088 0.0262857 -0.07813 0.0499415 -0.0262588 0.0461224 0.0935477 0.035905 -0.0231882 0.0356499 0.1164721 unknown
polarizability: 146.6593282|-6.1601091|111.8810514|0.6113941|-30.8062708|96.040097 unknown
InChI: InChI=1S/C3H3Cl3S3/c1-8-2(7)9-3(4,5)6/h1H3
charge 0 multiplicity 1
12 atoms
Cl 1.891536 -1.64808 -0.748049
Cl 2.016304 0.224485 1.629401
Cl 2.474065 1.290745 -1.164475
S  -0.284749 0.563587 -0.444129
S  -3.106604 -0.267508 0.365107
S  -0.8192 -1.879918 1.498266
C  1.503533 0.056213 -0.140248
C  -1.334336 -0.616494 0.538374
C  -3.250354 1.228647 -0.791565
H  -2.83856 0.993259 -1.783813
H  -2.755805 2.107164 -0.352179
H  -4.334129 1.4067 -0.86789
