program: Gaussian 09
title: 000033270
version: EM64L-G09RevD.01
frameworkgroup: C1[X(C12H14O4)]
method: RPBEPBE
basis: SDD
operation: Freq
keyword: #pfreq=noraman
keyword: PBEPBE/SDD
title: #p freq=noraman PBEPBE/SDD
converged: YES YES NO NO
title: Mulliken charges:
elementType: O O O O C C C C C C C C C C C C H H H H H H H H H H H H H H
charge: -0.302158 -0.260038 -0.438916 -0.263741 0.223375 0.188374 0.292800 -0.351618 -0.501426 0.357742 -0.389021 -0.831653 -0.416393 -0.519861 0.148021 -0.536294 0.254681 0.277785 0.244963 0.280659 0.271831 0.239458 0.263123 0.236724 0.223762 0.237753 0.248456 0.223367 0.224126 0.374121
chargesum: 0.00000
title: Mulliken charges with hydrogens summed into heavy atoms:
elementType: O O O O C C C C C C C C C C C C
charge: -0.302158 -0.260038 -0.064795 -0.263741 0.223375 0.188374 0.292800 -0.096938 -0.223641 0.357742 -0.144057 -0.039705 -0.153270 0.178377 0.148021 0.159654
polarizability: 2.48000992e+02 -3.41903587e-01 1.44659461e+02 1.90946090e+00 6.83341635e+00 9.19174772e+01
1716.lowfreq: -6.3916 -2.5573 -0.0005 -0.0003 -0.0002 4.3025 44.4211 49.7753 61.9005
frequency: 44.4161 49.7491 61.8956 79.1807 89.7915 100.9087 140.4497 145.7651 148.8120 182.5231 202.2737 222.4016 238.6043 261.2699 280.7441 318.7691 344.2422 359.9656 425.7126 459.1715 484.6168 538.3341 545.9841 586.4031 597.6855 604.5500 640.5920 699.6882 701.7465 741.5030 751.7812 804.9223 853.3987 882.9764 888.2374 890.7129 941.7391 966.2395 989.1226 1005.7510 1039.9407 1054.2799 1073.5528 1111.1863 1111.7543 1120.7435 1141.7653 1152.8800 1174.0977 1215.0747 1236.6563 1267.0238 1302.7003 1341.5432 1370.2926 1395.5765 1416.4711 1434.1451 1446.3644 1459.7967 1464.7445 1466.9493 1467.3015 1471.1074 1475.2578 1484.0953 1555.1114 1610.6632 1625.6192 1630.6594 2963.9424 2966.5527 2979.0985 3053.7446 3058.3852 3066.4537 3121.4327 3128.4325 3129.1001 3139.5043 3150.8630 3170.7067 3180.8147 3523.3680
redmass: 6.0294 4.8869 5.0816 2.0438 2.9845 2.2392 1.3835 2.0135 1.8679 3.0399 3.7450 1.5933 3.3893 5.1518 3.3702 3.7799 4.6759 4.5660 5.1799 3.7531 4.8424 4.9691 3.1805 1.1755 3.9869 4.3956 3.6896 5.2875 4.5834 3.5237 4.1765 1.4676 5.2554 2.0210 2.9073 1.6233 1.3564 8.5274 3.1965 2.8748 1.5211 2.0231 2.3505 1.3607 1.2586 1.7051 1.4910 1.4063 1.4855 1.8611 1.9294 1.9555 3.2012 2.7845 2.5447 1.2381 2.5519 1.2133 1.3884 1.0802 1.0714 1.0996 1.0557 1.0906 1.0910 2.3899 7.2597 6.3225 6.3423 7.3263 1.0328 1.0313 1.0441 1.1042 1.1043 1.0870 1.1013 1.1010 1.0996 1.0888 1.0904 1.0946 1.0925 1.0640
irintensity: 0.4414 0.3045 2.9515 4.4005 5.7453 3.1968 1.6878 1.6194 0.2605 2.1377 1.0089 0.2051 2.9161 1.2964 4.2700 3.3762 7.3262 5.9341 7.1217 12.2687 35.3366 24.1480 9.4719 141.8354 9.8623 3.4450 4.4464 7.7553 18.1330 4.0134 4.6363 43.1122 1.5353 12.1929 21.6399 21.9398 2.8279 16.8273 181.8911 133.8168 2.7788 300.7269 92.0886 43.4665 0.1495 75.5294 17.0225 38.8560 60.3126 44.1370 49.9731 80.4438 40.5175 42.1679 45.3657 59.7092 4.0994 11.8980 9.1236 7.7494 46.9695 25.9080 13.2135 105.5762 19.6572 37.7076 36.5105 597.5817 132.7676 187.6799 74.6024 50.7843 7.1885 44.6107 38.4513 5.9634 22.7319 1.1331 25.1401 5.2826 4.0123 10.7286 0.4392 48.2867
temp: 298.150 k
press: 1.00000 atm
elementType: 8 8 8 8 6 6 6 6 6 6 6 6 6 6 6 6 1 1 1 1 1 1 1 1 1 1 1 1 1 1
symmnumber: 1
zpe: 616210.7 jmol-1
zpe.correction: 0.234702 hartree
zpe.thermalcorrener: 0.251503 hartree
zpe.thermalcorrenthalpy: 0.252447 hartree
zpe.thermalcorrgfe: 0.189670 hartree
zpe.sumelectzpe: -765.344222 hartree
zpe.sumelectthermal: -765.327422 hartree
zpe.sumelectthermalent: -765.326477 hartree
zpe.sumelectthermalfe: -765.389255 hartree
dipole: 2.7744 -2.0492 -1.5349
dipole: 3.7753
quadrupole: -89.7582 -86.5703 -95.3366
quadrupole: -8.9881 4.3380 -4.8595
quadrupole: 0.7968 3.9847 -4.7816 -8.9881 4.3380 -4.8595
hfenergy: -765.5789246 hartree
pointgroup: C01 [X(C12H14O4)]
dipole: 1.1087581 0.3759338 0.9140334 debye
polarizability: 247.9649758|-0.4235737|125.402218|-2.6804593|26.3219447|111.2107372 unknown
InChI: InChI=1S/C12H14O4/c1-8(6-12(13)14)10-5-4-9(15-2)7-11(10)16-3/h4-7,13H,1-3H3
charge 0 multiplicity 1
30 atoms
O  0.349344 -2.112721 -1.218899
O  4.312536 0.150693 0.161753
O  -4.118507 1.223013 1.92712
O  -4.480072 0.640117 -0.291997
C  0.063297 0.132215 -0.157099
C  0.886754 -0.950477 -0.6114
C  -1.415385 0.193175 -0.361997
C  0.730086 1.226596 0.456753
C  2.285051 -0.908143 -0.487676
C  2.915987 0.213406 0.10255
C  2.132036 1.288168 0.592102
C  -1.940809 -0.110234 -1.751966
C  -2.207201 0.607484 0.688384
C  -0.484488 -2.958065 -0.340066
C  -3.663042 0.800225 0.654342
C  5.017856 1.274396 0.786792
H  0.127615 2.077404 0.793317
H  2.884611 -1.751442 -0.839495
H  2.590892 2.167383 1.052175
H  -3.025392 -0.289697 -1.752393
H  -1.396588 -0.957796 -2.200008
H  -1.74781 0.766968 -2.402083
H  -1.751061 0.800695 1.665062
H  -1.367017 -2.408861 0.03842
H  0.11423 -3.329931 0.513259
H  -0.809709 -3.80108 -0.968099
H  6.083322 1.008079 0.733117
H  4.716297 1.399325 1.844676
H  4.840145 2.2171 0.234233
H  -5.10518 1.344103 1.878426
