program: Gaussian 09
title: 000033321
version: EM64L-G09RevD.01
frameworkgroup: C1[X(C16H24N2OS)]
method: RPBEPBE
basis: SDD
operation: Freq
keyword: #p
keyword: freq=noraman
keyword: PBEPBE/SDD
title: #p freq=noraman PBEPBE/SDD
converged: YES YES NO NO
title: Mulliken charges:
elementType: S O N N C C C C C C C C C C C C C C C C H H H H H H H H H H H H H H H H H H H H H H H H
charge: 0.136470 -0.275119 -0.076739 -0.593642 -0.451401 -0.322234 0.326352 0.456125 -0.400789 -0.352615 -0.666598 -0.665073 0.238403 -0.360275 -0.418207 -0.364675 -0.258207 -0.255341 -0.616880 -0.625329 0.238491 0.220536 0.216730 0.217207 0.210689 0.228451 0.236643 0.208012 0.254156 0.228598 0.279361 0.239061 0.175722 0.210322 0.230567 0.227618 0.328839 0.330765 0.225850 0.184997 0.219338 0.231823 0.217681 0.184319
chargesum: 0.00000
title: Mulliken charges with hydrogens summed into heavy atoms:
elementType: S O N N C C C C C C C C C C C C C C C C
charge: 0.136470 -0.275119 -0.076739 0.065962 -0.451401 -0.322234 0.326352 0.456125 0.058238 0.081323 0.009185 0.025693 0.238403 -0.080914 -0.179146 0.021369 -0.027640 -0.027723 0.013305 0.008493
polarizability: 1.90578422e+02 -1.28903781e+01 2.08120208e+02 -8.02260792e+00 -5.36414158e-02 2.03064105e+02
1716.lowfreq: -8.9628 -4.4129 -0.0022 -0.0016 -0.0013 6.6228 28.2771 32.4664 33.8003
frequency: 27.8877 32.2365 33.6018 52.8717 68.8061 85.1209 102.8716 117.2971 133.6429 157.7863 184.5052 196.0377 219.2531 223.6288 232.9845 248.0509 254.1003 274.0169 276.7422 296.8468 316.5044 325.7640 351.6799 365.0411 375.0034 404.1745 407.0496 421.0005 472.2168 482.4824 511.3249 522.0251 549.1944 583.1819 602.1270 626.1184 654.2584 663.1740 709.4975 737.2032 758.4570 768.3592 772.9849 802.5578 820.2633 877.6658 885.2417 917.4322 918.6667 933.7432 957.4623 991.4908 1004.9667 1008.3627 1031.5993 1033.4127 1034.4149 1068.9097 1072.8090 1078.3513 1087.2655 1092.0175 1096.6389 1109.8494 1135.6197 1148.0818 1159.5412 1164.8856 1175.5170 1204.0241 1220.1529 1257.6818 1263.6961 1277.1877 1281.9148 1282.5488 1299.3021 1328.3850 1345.8521 1373.3590 1376.8878 1381.1255 1399.5163 1418.7673 1431.5300 1440.9123 1455.4809 1457.9751 1460.2937 1461.1842 1462.0698 1470.3341 1473.7876 1475.4650 1476.2833 1481.8498 1482.3136 1488.4746 1546.7061 1588.3380 1602.8506 1622.7673 2816.2277 2839.0272 2855.9816 2977.1643 2981.1294 2981.3562 2993.4875 3005.1546 3015.9041 3027.6696 3034.9688 3063.9660 3068.5748 3074.5869 3075.3056 3086.6553 3096.0156 3103.1252 3121.6815 3135.0936 3149.3944 3164.5394 3451.6874 3638.2270
redmass: 2.8455 4.2063 3.2421 4.8356 4.6230 4.4283 2.3880 2.4016 3.4298 3.4214 4.5691 3.0874 1.1953 1.1079 2.1454 1.2316 1.5979 2.8848 1.5455 3.8310 3.1658 2.7985 2.6681 3.7507 4.0540 9.8646 5.3311 2.6319 3.0183 3.1666 3.3373 3.9666 3.2930 3.2406 1.4466 4.1565 2.3383 1.4799 3.5300 1.6429 3.6158 1.9324 1.5100 2.4382 3.7891 1.5267 1.6399 3.4587 3.0905 1.4928 1.4368 1.3347 1.3979 2.8756 2.6962 1.6709 2.4155 2.0963 2.2824 2.6334 1.9720 1.5544 1.9654 1.7001 1.4830 1.7431 1.6805 3.8868 1.0640 2.6958 1.6586 2.0774 2.4555 1.7977 1.5570 1.2440 1.1788 3.4800 1.4388 1.4146 9.5959 1.1954 1.1997 1.1427 2.1819 1.1640 1.0525 1.0697 1.0724 1.0587 1.0482 1.4090 1.0962 1.0797 1.0866 1.4196 1.0706 1.0784 1.4146 7.3739 6.1980 4.5482 1.0701 1.0576 1.0578 1.0364 1.0373 1.0589 1.0616 1.0828 1.0716 1.0718 1.0994 1.1039 1.0981 1.0978 1.1008 1.0999 1.1008 1.1001 1.0863 1.0889 1.0940 1.1003 1.0485 1.1003
irintensity: 0.7758 0.4619 0.3975 3.8165 4.7317 0.9434 1.4500 0.3689 1.5991 0.4644 3.7757 0.0783 1.4062 0.1902 0.6092 0.2934 1.0544 0.3855 0.5043 0.2210 4.8295 15.1575 3.3773 0.1586 5.6781 2.7064 1.4200 0.8522 0.5984 15.4018 13.4245 1.7369 11.7283 7.5323 158.9015 11.9002 22.4988 26.1043 9.7926 8.2025 1.3053 12.9224 56.0877 21.6233 11.6734 1.6508 8.7436 1.4821 2.2574 0.3010 1.8585 0.3253 2.8431 12.4539 13.9464 19.4467 16.0989 0.4713 12.8488 6.4956 6.6632 8.0985 4.8721 18.3978 3.4434 15.4931 9.2784 4.8170 0.7409 0.6163 13.9188 10.4792 14.7774 6.7788 10.3232 6.9463 6.3329 134.2355 3.4660 12.5280 1.5186 22.5410 12.0242 2.0022 14.4210 3.3033 3.9489 5.8133 9.7432 1.6869 16.4484 5.5711 10.3650 11.9084 1.0287 36.1181 10.5752 17.4129 176.1883 2.3713 2.4385 235.7435 61.5726 69.4346 229.9497 15.5811 48.2655 4.0809 12.0443 38.4626 45.8801 41.2211 0.3256 33.5713 1.6273 34.4052 47.7491 48.3637 17.8145 23.5951 4.5733 11.8119 12.6792 24.7103 44.4019 79.0087
temp: 298.150 k
press: 1.00000 atm
elementType: 16 8 7 7 6 6 6 6 6 6 6 6 6 6 6 6 6 6 6 6 1 1 1 1 1 1 1 1 1 1 1 1 1 1 1 1 1 1 1 1 1 1 1 1
symmnumber: 1
zpe: 972263.8 jmol-1
zpe.correction: 0.370316 hartree
zpe.thermalcorrener: 0.392148 hartree
zpe.thermalcorrenthalpy: 0.393093 hartree
zpe.thermalcorrgfe: 0.319147 hartree
zpe.sumelectzpe: -1205.370182 hartree
zpe.sumelectthermal: -1205.348350 hartree
zpe.sumelectthermalent: -1205.347406 hartree
zpe.sumelectthermalfe: -1205.421351 hartree
dipole: 1.4363 -2.3146 -0.9355
dipole: 2.8802
quadrupole: -117.2807 -126.5496 -129.7714
quadrupole: -1.5219 -7.5369 -7.8008
quadrupole: 7.2532 -2.0157 -5.2375 -1.5219 -7.5369 -7.8008
hfenergy: -1205.7404982 hartree
pointgroup: C01 [X(C16H24N2O1S1)]
dipole: 0.514776 -0.865712 -0.519224 debye
polarizability: 188.8076778|-11.8409832|208.0716945|-7.8942135|1.7064616|204.8833624 unknown
InChI: InChI=1S/C16H24N2OS/c1-15(2)12-8-5-6-9-13(12)16(20-15,14(17)19)10-7-11-18(3)4/h5-6,8-9H,7,10-11,17H2,1-4H3
charge 0 multiplicity 1
44 atoms
S  0.853215 0.8320 -1.991617
O  1.256527 2.861969 1.543365
N  -4.309293 -0.309866 -0.087436
N  2.487703 2.799559 -0.42485
C  0.613492 1.161081 -0.108346
C  1.490491 -0.985253 -1.77681
C  1.104633 -0.124514 0.568869
C  1.528193 -1.188589 -0.262155
C  -0.880659 1.478726 0.196374
C  -1.863906 0.332365 -0.106768
C  2.894895 -1.091182 -2.416307
C  0.487845 -1.936609 -2.471604
C  1.481008 2.360139 0.398763
C  1.129444 -0.266505 1.977762
C  1.968052 -2.40119 0.322082
C  -3.305946 0.719191 0.282114
C  1.570763 -1.47671 2.55394
C  1.987663 -2.546737 1.726118
C  -5.687024 0.219564 -0.022377
C  -4.175239 -1.558919 0.689747
H  -0.9327 1.761243 1.265756
H  -1.166172 2.38183 -0.379184
H  -1.846347 0.089501 -1.185622
H  -1.546222 -0.57306 0.443608
H  3.271965 -2.129099 -2.338242
H  2.857826 -0.824492 -3.487672
H  3.613137 -0.423852 -1.910871
H  0.821366 -2.986548 -2.362103
H  -0.517902 -1.841809 -2.030533
H  0.418773 -1.710562 -3.550582
H  0.82801 0.577452 2.607211
H  2.296644 -3.230484 -0.315219
H  -3.343781 0.954664 1.380295
H  -3.57674 1.651316 -0.252144
H  1.594521 -1.585114 3.643818
H  2.329654 -3.486432 2.173898
H  3.089333 3.556485 -0.10198
H  2.602503 2.380043 -1.35175
H  -5.777807 1.103947 -0.678108
H  -6.001739 0.52112 1.010327
H  -6.397566 -0.546523 -0.382358
H  -3.17925 -2.006174 0.534804
H  -4.929289 -2.288764 0.344183
H  -4.31897 -1.407607 1.791503
