program: Gaussian 09
title: 000033229
version: EM64L-G09RevD.01
frameworkgroup: C1[X(C15H19N)]
method: RPBEPBE
basis: SDD
operation: Freq
keyword: #pfreq=noraman
keyword: PBEPBE/SDD
title: #p freq=noraman PBEPBE/SDD
converged: YES YES NO NO
title: Mulliken charges:
elementType: N C C C C C C C C C C C C C C C H H H H H H H H H H H H H H H H H H H
charge: -0.077784 -0.586279 -0.405451 0.425794 -0.336292 0.176063 0.393969 -0.458918 -0.387917 -0.461195 -0.243979 -0.436554 -0.626759 -0.615850 -0.269538 -0.244970 0.205449 0.216651 0.230046 0.230401 0.209042 0.168705 0.234783 0.239103 0.237644 0.224516 0.182611 0.219122 0.237497 0.224578 0.221580 0.185002 0.236424 0.225134 0.227371
chargesum: 0.00000
title: Mulliken charges with hydrogens summed into heavy atoms:
elementType: N C C C C C C C C C C C C C C C
charge: -0.077784 -0.164179 0.054996 0.425794 0.041455 0.176063 0.393969 -0.224135 -0.148813 -0.223551 -0.019464 -0.200130 0.012470 0.015311 -0.044404 -0.017599
polarizability: 2.04033461e+02 -8.99004843e+00 2.00726927e+02 -2.21583505e+01 -7.78821906e+00 1.05818357e+02
1716.lowfreq: -20.9454 -9.8713 -7.3652 -0.0007 -0.0005 0.0003 13.4147 27.8116 48.4024
frequency: -7.4908 27.7603 48.3818 94.4243 124.8464 134.7645 172.8501 181.2187 220.7030 235.7841 248.7121 286.5179 314.0936 334.3764 410.9193 425.9609 430.6356 466.1949 475.6806 497.8298 508.5637 564.3385 596.9025 655.2969 701.6448 743.0523 759.5486 784.8090 790.5016 811.0537 812.3801 853.7119 869.9770 879.0441 916.5543 958.5198 982.1663 990.6370 1003.2795 1017.9713 1026.1069 1030.5136 1033.9991 1071.6370 1074.9187 1089.8473 1092.7173 1124.6464 1149.4440 1156.5920 1173.2041 1181.0992 1210.2326 1235.3336 1243.8892 1258.1268 1265.8655 1273.7347 1284.9846 1295.5672 1334.9909 1373.4137 1379.5932 1405.6930 1416.8694 1417.3568 1439.5109 1441.6829 1455.6009 1459.7010 1461.0551 1473.9743 1475.7933 1479.2408 1484.5811 1493.4509 1517.5671 1589.7509 1598.4529 1632.5499 2804.1144 2837.3255 2854.8831 2974.7906 2994.8606 3002.0770 3016.5257 3024.9578 3030.0734 3063.9933 3075.7849 3088.3392 3117.3770 3119.6179 3127.1534 3129.7873 3146.2268 3153.9501 3161.8079
redmass: 2.8481 3.4483 4.0353 2.7399 2.5902 2.3443 3.6598 3.4776 1.2184 1.1777 2.6627 2.8265 2.8266 2.3769 2.8164 2.5361 3.1209 2.9696 3.1388 5.6159 5.4849 3.8619 4.0697 3.4323 4.3996 1.2711 1.1751 4.2771 1.9145 4.1577 1.6332 1.5601 2.4508 2.0060 1.4459 1.3811 1.3564 1.3546 3.1682 2.5562 2.9061 1.8833 1.9699 2.2394 2.2679 1.7481 1.4093 1.2974 1.4667 1.5698 1.1154 1.2177 1.8088 1.8001 1.6479 2.0557 1.6652 1.3676 1.6502 1.2157 1.4591 1.3998 2.1056 2.9655 5.2671 1.1435 1.1750 2.3713 2.5538 1.0601 1.0591 1.0703 1.0623 1.0800 1.0652 1.1057 3.6844 7.5938 5.2880 6.5641 1.0702 1.0578 1.0576 1.0603 1.0730 1.0719 1.0715 1.0993 1.0715 1.1042 1.1010 1.1000 1.0862 1.0856 1.0910 1.0881 1.0944 1.0993 1.1003
irintensity: 0.3663 0.2370 0.1811 0.5118 0.6239 0.2496 1.7497 0.7200 0.9562 0.1166 1.3990 1.8705 8.2351 4.1622 3.4134 2.0732 1.9846 7.4759 5.7235 0.7079 0.8330 2.4280 4.3208 0.6980 0.9474 3.8231 2.8072 5.0819 78.4502 12.7031 56.9813 1.6853 2.8157 5.4711 0.2359 1.9571 1.9521 1.1107 8.3193 23.5293 2.7370 5.9624 12.8302 24.9624 4.0130 3.1918 6.8531 8.7401 0.4316 13.5273 1.1028 1.1224 12.2576 3.0043 3.4563 2.4242 4.9269 1.5415 9.7738 5.8789 0.2244 14.1288 9.8315 4.7860 4.1875 2.5408 4.4528 2.2649 1.7689 8.7975 16.6183 7.2008 12.3104 4.7397 12.2741 18.8464 10.2354 4.2615 8.5184 0.3434 83.1478 71.7860 223.3638 25.6280 5.5792 50.3498 47.5653 5.4686 45.2339 39.7882 38.6103 47.1796 5.2995 1.0902 18.7831 5.5191 40.4275 43.3379 24.9058
temp: 298.150 k
press: 1.00000 atm
elementType: 7 6 6 6 6 6 6 6 6 6 6 6 6 6 6 6 1 1 1 1 1 1 1 1 1 1 1 1 1 1 1 1 1 1 1
symmnumber: 1
zpe: 787493.0 jmol-1
zpe.correction: 0.299940 hartree
zpe.thermalcorrener: 0.314380 hartree
zpe.thermalcorrenthalpy: 0.315324 hartree
zpe.thermalcorrgfe: 0.258038 hartree
zpe.sumelectzpe: -636.555697 hartree
zpe.sumelectthermal: -636.541258 hartree
zpe.sumelectthermalent: -636.540314 hartree
zpe.sumelectthermalfe: -636.597599 hartree
dipole: 0.5962 0.5853 -0.5470
dipole: 0.9986
quadrupole: -88.6980 -89.0071 -100.9563
quadrupole: 1.3994 -6.7159 0.0496
quadrupole: 4.1892 3.8800 -8.0692 1.3994 -6.7159 0.0496
hfenergy: -636.8556375 hartree
pointgroup: C01[X(C15H19N1)]
dipole: -0.2233859 0.2504378 0.2043029 debye
polarizability: 204.6087419|7.7633774|200.5754414|-22.6469552|4.1139362|105.3945619 unknown
InChI: InChI=1S/C15H19N/c1-16(2)12-6-10-14-9-5-8-13-7-3-4-11-15(13)14/h3-5,7-9,11H,6,10,12H2,1-2H3
charge 0 multiplicity 1
35 atoms
N  -4.348149 0.207137 -0.467048
C  -0.918651 -0.829055 1.051947
C  -1.916357 -0.34169 -0.037429
C  0.487274 -1.051058 0.512763
C  -3.311237 -0.060544 0.557474
C  1.393888 0.054903 0.284977
C  2.709066 -0.206446 -0.271956
C  0.912576 -2.348726 0.195689
C  1.049349 1.415634 0.59278
C  3.090617 -1.55247 -0.585958
C  2.206605 -2.605767 -0.353693
C  3.608964 0.888304 -0.497204
C  -4.108101 1.446026 -1.234187
C  -5.7085 0.178089 0.108184
C  1.947455 2.461391 0.365182
C  3.240264 2.198305 -0.187562
H  -0.909345 -0.098233 1.885432
H  -1.29839 -1.778498 1.475701
H  -1.50747 0.563741 -0.523229
H  -2.013942 -1.113007 -0.824275
H  -3.63643 -0.952257 1.129881
H  -3.232267 0.784019 1.296714
H  0.23154 -3.19033 0.371753
H  0.066547 1.638571 1.020903
H  4.08552 -1.738778 -1.007817
H  2.498056 -3.635396 -0.588845
H  -4.091911 2.36487 -0.591522
H  -4.906628 1.571037 -1.987223
H  -3.14755 1.386524 -1.772469
H  -5.883635 -0.794816 0.601631
H  -6.455742 0.291121 -0.697892
H  -5.892547 0.986183 0.862944
H  4.599237 0.6757 -0.918203
H  1.664227 3.490866 0.611624
H  3.935769 3.026453 -0.362966
