program: Gaussian 09
title: 000033227
version: EM64L-G09RevD.01
frameworkgroup: C1[X(C19H27N)]
method: RPBEPBE
basis: SDD
operation: Freq
keyword: #pfreq=noraman
keyword: PBEPBE/SDD
title: #p freq=noraman PBEPBE/SDD
converged: YES YES NO NO
title: Mulliken charges:
elementType: N C C C C C C C C C C C C C C C C C C C H H H H H H H H H H H H H H H H H H H H H H H H H H H
charge: -0.075924 -0.157484 -0.033219 -0.506078 0.370916 -0.390798 -0.381829 -0.757611 0.137417 -0.431747 -0.724122 0.402853 -0.275019 -0.381402 -0.472047 -0.625854 -0.616933 -0.437518 -0.277708 -0.247470 0.179164 0.220014 0.224300 0.216796 0.231696 0.205130 0.172656 0.240949 0.224208 0.206708 0.210178 0.249447 0.213131 0.212870 0.216305 0.225394 0.237307 0.238059 0.233842 0.183542 0.218567 0.219054 0.184900 0.227886 0.236653 0.225096 0.227726
chargesum: 0.00000
title: Mulliken charges with hydrogens summed into heavy atoms:
elementType: N C C C C C C C C C C C C C C C C C C C
charge: -0.075924 0.021679 0.186794 -0.064982 0.370916 0.046028 0.031776 -0.116517 0.137417 -0.182300 -0.081817 0.402853 -0.049625 -0.144095 -0.233988 0.010097 0.014907 -0.200865 -0.052612 -0.019744
polarizability: 2.52405013e+02 2.01349843e+01 1.86164939e+02 2.20259440e+01 -2.45464138e+01 2.02306598e+02
1716.lowfreq: -15.1657 -10.3673 -0.0005 0.0003 0.0007 7.4129 26.9833 34.1235 43.3007
frequency: 26.8388 33.9763 43.0536 45.6620 58.1138 73.0799 99.2809 133.4022 148.2287 173.0018 179.3005 183.6451 193.0323 230.5242 238.8560 240.7674 255.6318 275.9858 291.8384 305.9942 335.2539 375.5325 409.9536 419.2913 425.5866 438.8598 472.0393 489.6049 504.6021 522.2434 564.5125 594.4849 617.1906 659.4608 704.7780 743.5886 761.0054 783.9763 787.3219 795.5890 802.4537 813.5306 824.3827 850.1137 877.0088 918.6106 929.2819 957.5354 961.0112 973.4156 984.4918 989.2963 991.2901 1018.0506 1025.6819 1032.8667 1036.1972 1039.1606 1046.7049 1076.0938 1089.6401 1094.3265 1118.3698 1124.9496 1139.0323 1152.6265 1162.7356 1170.0471 1176.2432 1187.2681 1218.2223 1231.4981 1239.9223 1246.1339 1263.6547 1264.6871 1273.8305 1297.3242 1300.2808 1315.5884 1336.1255 1341.2729 1357.4600 1376.8042 1382.7749 1384.2846 1392.7357 1404.1098 1416.3344 1417.8895 1438.5720 1441.7622 1454.3750 1461.8442 1463.3763 1464.4995 1473.8680 1476.0638 1477.7681 1479.4605 1483.4142 1485.5509 1488.1268 1495.9303 1515.6559 1588.1734 1598.4082 1630.1341 2813.9950 2837.7596 2855.9326 2953.5636 2964.4811 2971.0613 2973.9843 2975.1976 2999.4226 3016.5758 3023.9464 3025.2169 3028.5879 3055.4620 3059.3763 3068.1875 3071.1149 3075.9644 3076.1400 3085.3951 3118.5604 3120.5296 3130.1181 3137.1399 3148.6751 3156.0441 3163.0809
redmass: 3.2446 3.9518 2.8331 2.7915 2.5172 2.7405 3.0498 2.5335 2.8521 1.5350 2.0397 3.0755 2.8785 1.5086 1.2345 1.3502 1.7319 2.3155 2.9762 2.5587 2.2172 3.1418 2.6655 2.7077 2.8984 2.6978 3.2642 3.5576 5.1716 4.9353 3.4257 3.2365 3.5412 3.6001 2.8674 1.3198 1.8438 3.0977 2.3055 1.8529 1.5027 1.6852 2.5432 2.7482 1.7896 1.7344 1.6065 1.3229 1.3964 2.1277 1.3520 2.1800 1.3761 2.1429 2.2953 1.5656 2.2917 2.0030 2.7170 1.9695 1.8109 1.5744 1.8206 1.7439 1.8018 1.5438 1.9029 1.6104 1.1619 1.2930 1.6784 1.9974 1.8626 1.4160 1.7999 2.3976 1.2291 1.2330 1.2447 1.3913 1.3862 1.5004 1.5494 1.3440 1.7280 1.2542 1.2124 2.9071 4.2035 1.1560 2.4804 1.1687 2.2205 1.0504 1.0943 1.0587 1.0505 1.0654 1.0524 1.0715 1.0576 1.0558 1.0526 1.0892 3.6776 7.4897 5.1608 6.4025 1.0705 1.0577 1.0576 1.0808 1.0719 1.0389 1.0597 1.0440 1.0601 1.0718 1.0923 1.0895 1.0746 1.1012 1.0988 1.0991 1.0995 1.0990 1.0999 1.1001 1.0862 1.0856 1.0884 1.0913 1.0939 1.0981 1.0997
irintensity: 0.2740 0.0506 0.3332 0.0428 0.0177 0.1220 0.0666 0.6998 0.2293 0.3193 1.7879 0.8238 0.2292 0.2782 0.2143 0.8045 1.9787 1.6068 1.2442 0.0193 8.6256 1.1975 2.6071 1.1812 3.6912 2.1728 0.0745 5.8236 2.4914 1.6178 3.3463 6.3578 3.4993 2.6457 2.1323 4.4456 4.6254 15.0329 25.8198 38.1731 7.7337 62.4146 5.8319 2.4050 6.6567 0.7170 1.5363 4.1340 1.9562 0.2643 1.9857 3.1821 1.5542 14.7353 16.7338 19.7558 6.6893 14.0471 6.6350 15.2632 6.9989 6.6173 2.3020 9.7769 6.1643 5.2265 12.8686 2.5009 0.7120 1.6510 6.3865 3.8878 1.7315 1.2214 2.8934 6.2904 2.6822 12.7025 12.3038 4.7182 6.0176 0.7584 8.2558 7.4594 1.7730 16.2340 12.8712 3.9568 8.4368 2.6994 4.8841 2.7939 3.1898 17.0743 11.4301 2.2139 12.7058 11.8883 13.3956 3.3678 16.0077 5.8220 7.3368 14.0515 10.3923 4.4085 6.4168 0.3533 58.4324 73.9400 220.4687 21.3699 6.7446 31.6203 55.6330 21.3265 17.3502 40.9634 9.3366 48.5509 24.9529 39.0854 37.0488 54.9115 71.2930 53.7063 31.6147 43.0866 1.7528 1.4294 6.2059 23.2258 41.2677 32.9395 23.6953
temp: 298.150 k
press: 1.00000 atm
elementType: 7 6 6 6 6 6 6 6 6 6 6 6 6 6 6 6 6 6 6 6 1 1 1 1 1 1 1 1 1 1 1 1 1 1 1 1 1 1 1 1 1 1 1 1 1 1 1
symmnumber: 1
zpe: 1079515.7 jmol-1
zpe.correction: 0.411166 hartree
zpe.thermalcorrener: 0.432114 hartree
zpe.thermalcorrenthalpy: 0.433058 hartree
zpe.thermalcorrgfe: 0.360607 hartree
zpe.sumelectzpe: -793.443982 hartree
zpe.sumelectthermal: -793.423034 hartree
zpe.sumelectthermalent: -793.422090 hartree
zpe.sumelectthermalfe: -793.494541 hartree
dipole: 0.2517 0.1248 -0.8213
dipole: 0.8680
quadrupole: -115.6790 -122.8066 -119.2848
quadrupole: 2.7102 -1.1082 -3.7985
quadrupole: 3.5778 -3.5498 -0.0280 2.7102 -1.1082 -3.7985
hfenergy: -793.855148 hartree
pointgroup: C01 [X(C19H27N1)]
dipole: -0.1019469 0.0112262 0.3257384 debye
polarizability: 256.3335753|-13.4401118|178.2523454|17.7267669|25.0343091|206.2906297 unknown
InChI: InChI=1S/C19H27N/c1-5-15(2)17(13-14-20(3)4)19-12-8-10-16-9-6-7-11-18(16)19/h6-12,15,17H,5,13-14H2,1-4H3
charge 0 multiplicity 1
47 atoms
N  -3.802775 -1.806027 -0.039763
C  -0.794339 0.616904 0.487838
C  -0.624402 2.188339 0.437286
C  -2.231729 0.166176 0.114461
C  0.317881 -0.070766 -0.318644
C  -1.035895 2.786203 -0.935587
C  -2.506601 -1.307227 0.481544
C  -1.364631 2.870065 1.614166
C  1.652364 -0.195346 0.242128
C  0.09556 -0.554079 -1.616472
C  -0.579785 4.248383 -1.137107
C  2.707383 -0.805513 -0.548718
C  1.134545 -1.151806 -2.393753
C  1.990911 0.259765 1.563726
C  2.420645 -1.275386 -1.872084
C  -4.973108 -1.140299 0.567338
C  -3.903256 -3.276679 0.064944
C  4.025738 -0.932679 0.003469
C  3.283047 0.121205 2.07676
C  4.315073 -0.479679 1.290895
H  -0.656907 0.333005 1.553245
H  0.459648 2.392053 0.566078
H  -2.438228 0.298852 -0.963118
H  -2.943741 0.821851 0.649517
H  -0.599666 2.163402 -1.741167
H  -2.137265 2.727664 -1.049512
H  -2.438146 -1.424542 1.597528
H  -1.710546 -1.938548 0.044758
H  -1.14176 3.951234 1.652718
H  -1.058687 2.433422 2.584374
H  -2.462116 2.760922 1.526581
H  -0.904994 -0.485963 -2.055714
H  -1.052416 4.932375 -0.408563
H  0.517227 4.338806 -1.022739
H  -0.842719 4.608885 -2.148798
H  0.909169 -1.512324 -3.403562
H  1.222843 0.723483 2.190128
H  3.224719 -1.732818 -2.460852
H  -4.950073 -0.056877 0.361964
H  -5.031696 -1.283189 1.678178
H  -5.89881 -1.546468 0.121573
H  -4.838208 -3.621662 -0.412693
H  -3.899106 -3.649004 1.121997
H  -3.054624 -3.745386 -0.464463
H  4.807255 -1.397377 -0.61012
H  3.509532 0.474479 3.089002
H  5.325089 -0.582831 1.702533
