program: Gaussian 09
title: 000033235
version: EM64L-G09RevD.01
frameworkgroup: C1[X(C16H21N)]
method: RPBEPBE
basis: SDD
operation: Freq
keyword: #pfreq=noraman
keyword: PBEPBE/SDD
title: #p freq=noraman PBEPBE/SDD
converged: YES YES NO NO
title: Mulliken charges:
elementType: N C C C C C C C C C C C C C C C C H H H H H H H H H H H H H H H H H H H H H
charge: -0.075253 -0.413586 -0.583404 -0.332580 0.426496 0.177115 -0.295752 0.394093 -0.460120 -0.643096 -0.387632 -0.461545 -0.243906 -0.703504 -0.437098 -0.270013 -0.245017 0.230560 0.226953 0.214963 0.205391 0.167962 0.206509 0.170827 0.208071 0.234634 0.231720 0.180166 0.232595 0.239104 0.237615 0.224453 0.230038 0.213901 0.210444 0.236396 0.225161 0.227338
chargesum: 0.00000
title: Mulliken charges with hydrogens summed into heavy atoms:
elementType: N C C C C C C C C C C C C C C C C
charge: -0.075253 0.043927 -0.163050 0.041891 0.426496 0.177115 0.083146 0.394093 -0.225486 0.001385 -0.148528 -0.223930 -0.019453 -0.049121 -0.200702 -0.044852 -0.017679
polarizability: 2.21171430e+02 -9.91627846e+00 2.09846609e+02 2.37154006e+01 7.33448555e+00 1.15937648e+02
1716.lowfreq: -9.3376 -4.2341 -0.0005 -0.0005 -0.0001 7.0520 23.1988 27.4602 45.5850
frequency: 22.6167 26.9822 45.5683 70.8273 103.6279 111.5769 137.7471 164.0978 178.1126 197.0616 238.0340 249.1726 282.2735 292.1357 350.4054 358.9332 409.3393 430.1895 440.7045 471.9564 482.8054 505.6899 513.2661 565.6163 598.4852 654.7832 702.0462 743.1493 758.0678 778.0793 786.6504 790.6353 803.3078 812.7509 850.8895 868.8278 878.8478 915.8690 947.3213 958.8574 982.0675 990.5373 1007.9489 1018.8342 1031.1753 1043.9807 1052.6909 1075.2339 1081.5955 1092.1472 1097.0928 1123.8189 1146.7102 1153.1629 1173.3085 1181.1570 1207.5074 1226.2525 1235.5759 1243.8343 1262.3397 1271.7700 1281.7792 1285.8150 1305.3717 1332.7116 1347.8125 1379.4314 1382.5816 1393.7248 1405.8339 1416.5741 1432.2457 1441.8390 1455.3793 1458.2832 1466.8041 1472.8944 1473.8498 1479.2651 1488.5433 1492.4063 1494.2789 1517.5553 1589.6259 1598.4750 1632.6020 2806.0197 2828.2399 2845.8583 2973.8115 2985.9542 2996.9236 3003.4093 3011.6412 3024.1295 3046.2155 3066.4049 3078.7938 3090.1849 3098.6281 3117.3272 3119.5855 3127.1388 3129.7295 3146.1363 3153.9492 3161.7642
redmass: 3.0602 3.5361 3.7259 2.7994 2.0202 2.1419 2.6650 3.7706 3.8583 1.1253 3.2120 1.4673 2.4464 2.8554 2.3307 2.2241 3.2097 3.1492 3.2794 3.2748 3.2821 5.0516 4.2501 3.6200 4.1552 3.4511 4.3559 1.2646 1.1665 3.5581 3.4825 2.0770 1.1342 1.6080 1.5981 2.5082 1.8885 1.4503 2.3557 1.3806 1.3581 1.3533 3.1823 3.1480 2.1097 2.4935 2.1967 2.4049 2.1234 1.8399 1.5943 1.4536 1.5826 1.4970 1.1161 1.2165 2.0713 1.8143 1.7668 1.6457 1.4748 1.3939 1.4346 1.2154 1.2578 1.4347 1.4093 2.1126 1.2500 1.3418 2.9548 5.2811 1.1659 2.3980 2.5533 1.0746 1.0448 1.0679 1.0700 1.0826 1.0712 1.0545 1.1028 3.6834 7.5895 5.2833 6.5548 1.0704 1.0696 1.0600 1.0603 1.0358 1.0806 1.0655 1.0861 1.0993 1.0704 1.1036 1.0986 1.1005 1.0999 1.0862 1.0857 1.0910 1.0881 1.0944 1.0993 1.1003
irintensity: 0.2874 0.1302 0.2093 0.0144 0.4426 0.4128 0.1159 0.3924 1.8260 1.2502 0.6669 1.6522 2.8844 0.8331 4.5683 2.9566 2.5827 3.0380 6.5944 0.1428 7.1717 1.2550 3.4549 3.1676 5.2835 0.6775 0.8265 3.8527 1.9454 10.7986 15.2702 71.3587 5.9817 53.6807 1.5915 0.5909 6.0579 0.1404 10.4464 2.4776 1.9363 0.9186 3.9828 20.9551 5.9954 10.7341 35.0310 13.4288 3.7690 5.7120 4.1223 7.1497 11.6172 18.6546 0.9636 1.1328 10.7178 13.0942 2.6376 3.9755 2.6905 0.9917 11.3055 2.9362 7.5079 5.5738 23.9947 11.0276 15.8458 5.9471 4.7559 4.5488 4.3337 3.1080 1.7853 1.2673 10.6479 6.9680 3.1742 4.6831 10.1352 9.2288 26.2796 10.0947 4.6593 8.7772 0.3733 62.1285 96.8463 189.6541 27.8509 33.5996 6.1011 28.1824 42.1786 6.5233 35.1174 38.0635 63.1208 33.9298 39.0551 5.5471 1.1451 18.8219 5.3495 41.1509 43.5608 24.8517
temp: 298.150 k
press: 1.00000 atm
elementType: 7 6 6 6 6 6 6 6 6 6 6 6 6 6 6 6 6 1 1 1 1 1 1 1 1 1 1 1 1 1 1 1 1 1 1 1 1 1
symmnumber: 1
zpe: 861512.1 jmol-1
zpe.correction: 0.328133 hartree
zpe.thermalcorrener: 0.344808 hartree
zpe.thermalcorrenthalpy: 0.345753 hartree
zpe.thermalcorrgfe: 0.282194 hartree
zpe.sumelectzpe: -675.779627 hartree
zpe.sumelectthermal: -675.762951 hartree
zpe.sumelectthermalent: -675.762007 hartree
zpe.sumelectthermalfe: -675.825565 hartree
dipole: 0.6244 0.4536 0.6397
dipole: 1.0024
quadrupole: -96.0674 -94.9574 -107.3037
quadrupole: 0.4632 7.3311 0.1467
quadrupole: 3.3754 4.4854 -7.8608 0.4632 7.3311 0.1467
hfenergy: -676.1077598 hartree
pointgroup: C01 [X(C16H21N1)]
dipole: -0.240449 0.1997471 -0.2404655 debye
polarizability: 221.7718333|8.1998695|209.8864925|23.9392933|-2.6278684|115.2973606 unknown
InChI: InChI=1S/C16H21N/c1-3-17(2)13-7-11-15-10-6-9-14-8-4-5-12-16(14)15/h4-6,8-10,12H,3,7,11,13H2,1-2H3
charge 0 multiplicity 1
38 atoms
N  -3.950177 0.200721 0.289686
C  -1.506597 -0.367626 -0.064002
C  -0.468714 -0.841627 -1.121401
C  -2.892387 -0.130504 -0.699033
C  0.921415 -1.052284 -0.538514
C  1.80519 0.062221 -0.26653
C  -5.309095 0.050362 -0.297349
C  3.103719 -0.189424 0.332635
C  1.353763 -2.348493 -0.225055
C  -3.744773 1.529449 0.904788
C  1.454073 1.422237 -0.569844
C  3.492801 -1.534549 0.641182
C  2.63201 -2.596143 0.364027
C  -6.437078 0.084214 0.750351
C  3.979764 0.913952 0.604592
C  2.328947 2.47662 -0.296173
C  3.604244 2.223177 0.299891
H  -1.605179 -1.129959 0.731211
H  -1.13303 0.553091 0.421344
H  -0.824563 -1.793391 -1.560664
H  -0.439541 -0.107838 -1.952016
H  -2.802199 0.663052 -1.490965
H  -3.201685 -1.060099 -1.216992
H  -5.505951 0.829548 -1.081631
H  -5.334152 -0.930335 -0.810213
H  0.690494 -3.196414 -0.435368
H  -4.507735 1.711581 1.679322
H  -3.797462 2.365067 0.158479
H  -2.760063 1.571503 1.398667
H  0.484887 1.637784 -1.031507
H  4.475263 -1.713507 1.094262
H  2.929782 -3.625087 0.594231
H  -6.230126 -0.645167 1.553391
H  -6.556694 1.081424 1.209877
H  -7.401181 -0.178396 0.277212
H  4.957347 0.708607 1.057683
H  2.040661 3.505439 -0.53948
H  4.281524 3.057895 0.511707
