program: Gaussian 09
title: 000033193
version: EM64L-G09RevD.01
frameworkgroup: C1[X(C9H6ClFO)]
method: RPBEPBE
basis: SDD
operation: Freq
keyword: #p
keyword: freq=noraman
keyword: PBEPBE/SDD
title: #p freq=noraman PBEPBE/SDD
converged: YES YES NO NO
title: Mulliken charges:
elementType: Cl F O C C C C C C C C C H H H H H H
charge: -0.007304 -0.193004 -0.240561 0.315743 -0.294109 -0.313758 -0.380673 -0.366065 0.096059 0.333682 -0.101528 -0.426670 0.225641 0.287665 0.262283 0.264278 0.237042 0.301281
chargesum: 0.00000
title: Mulliken charges with hydrogens summed into heavy atoms:
elementType: Cl F O C C C C C C C C C
charge: -0.007304 -0.193004 -0.240561 0.315743 -0.068468 -0.026093 -0.118390 -0.101787 0.096059 0.333682 0.135514 -0.125389
polarizability: 2.01526453e+02 1.93582588e+00 1.08729077e+02 -7.17845109e-02 -2.79085155e-02 4.14385948e+01
1716.lowfreq: -0.0025 -0.0017 -0.0013 4.3130 6.8647 9.7106 28.4013 63.2917 83.7130
frequency: 27.6641 63.1881 83.7086 125.3979 177.4564 228.4942 247.8245 302.4739 356.2252 379.0442 410.2207 472.9175 494.3620 577.2345 625.8290 662.3717 712.1463 739.4203 801.3681 815.3839 835.1933 862.1291 864.1876 935.1812 954.9952 993.5140 1000.5368 1019.8517 1108.6692 1157.6250 1189.1851 1206.3723 1251.3988 1283.9510 1320.9293 1378.8357 1412.5520 1493.0262 1520.0522 1589.9239 1606.9526 1619.8538 3155.9595 3160.0724 3174.1334 3179.7414 3183.7491 3191.5669
redmass: 4.6719 3.2187 11.2425 4.7950 6.5087 7.9293 11.5839 6.8543 10.7722 6.3983 2.9028 5.3776 2.9676 8.2400 7.2170 3.5368 8.9499 3.2343 6.8172 1.3095 1.7674 4.6061 1.9853 1.1781 1.2728 1.3512 3.3757 2.8985 1.3196 1.4000 1.3795 2.0755 1.9669 1.5064 1.5480 5.5450 4.3175 2.6232 11.2590 7.5761 6.2750 6.9934 1.0895 1.0890 1.0913 1.0964 1.0965 1.0948
irintensity: 0.2008 0.5933 0.1476 3.2883 2.4929 8.3251 0.7445 0.1689 1.1662 6.5254 0.0017 2.5158 11.4220 62.5290 0.9632 19.0720 70.2535 7.2668 45.4581 9.1797 31.0705 15.5593 31.6202 68.9999 20.8398 0.7565 23.0253 14.3686 14.7446 96.4196 33.8241 11.5388 176.9595 51.9552 79.1130 22.5705 10.1023 28.5443 144.6164 105.8075 297.5455 122.4435 4.6193 0.2250 4.8800 6.3343 4.5503 1.3404
temp: 298.150 k
press: 1.00000 atm
elementType: 17 9 8 6 6 6 6 6 6 6 6 6 1 1 1 1 1 1
symmnumber: 1
zpe: 322709.8 jmol-1
zpe.correction: 0.122914 hartree
zpe.thermalcorrener: 0.133714 hartree
zpe.thermalcorrenthalpy: 0.134659 hartree
zpe.thermalcorrgfe: 0.084276 hartree
zpe.sumelectzpe: -980.813967 hartree
zpe.sumelectthermal: -980.803166 hartree
zpe.sumelectthermalent: -980.802222 hartree
zpe.sumelectthermalfe: -980.852604 hartree
dipole: 0.3242 -1.6946 -0.0046
dipole: 1.7254
quadrupole: -82.7511 -73.4198 -77.9336
quadrupole: 3.8720 -0.0203 -0.0413
quadrupole: -4.7163 4.6151 0.1012 3.8720 -0.0203 -0.0413
hfenergy: -980.9368809 hartree
pointgroup: C01 [X(C9H6Cl1F1O1)]
dipole: 0.1717706 0.6508167 -0.0878701 debye
dipolederiv: -0.7873204 0.2361103 -0.0388098 0.6054238 -0.3262637 0.0439863 -0.0881712 0.0404304 -0.0468043 -1.3095909 -0.1946384 0.0169236 -0.242323 -0.2489285 0.0123224 0.0239113 0.0127302 -0.1490208 -0.8213702 -0.1284065 0.0136345 -0.0515721 -0.8764568 0.0737438 0.0044434 0.0733015 -0.3428577 -0.9552679 -0.1161386 0.007756 -0.0930933 -0.1736401 0.0210128 0.0058089 0.0212284 -0.0187939 0.2549272 0.0061249 0.0028132 0.2318786 0.0940706 -0.0286189 -0.0278705 -0.0303934 -0.1143981 0.2731828 0.0773387 -0.0075517 -0.1671726 0.0622338 -0.024226 0.0259827 -0.0217401 -0.0910815 -0.4814237 0.0069855 -0.0041377 0.2670705 -0.0027768 -0.0201686 -0.0417614 -0.0226407 -0.1571426 -0.2866236 -0.1401713 0.019058 -0.3988697 -0.1364847 -0.0069707 0.0561453 -0.0045236 -0.1573488 2.1625064 0.0238611 0.0132519 -0.3483461 0.9286306 -0.1033412 0.0620375 -0.100769 0.205463 1.449017 0.2023816 -0.0163439 0.2570616 0.3989746 -0.0383342 -0.0246087 -0.0388271 0.1207685 -1.2785961 0.4028236 -0.0644699 0.2797912 -0.1638176 0.0040749 -0.0489608 0.005148 -0.1593389 1.3662907 -0.4587421 0.0761915 -0.4868097 0.408133 -0.0784484 0.0795558 -0.0782381 -0.1340098 0.0280887 0.0984896 -0.0154675 0.1132129 0.0058639 0.0214519 -0.0173645 0.0211405 0.1440115 0.1489156 -0.0552391 0.0079204 -0.003985 0.0274906 0.0184409 0.0009685 0.0176848 0.1523332 0.0656486 -0.03991 0.0045979 -0.0594001 -0.0117277 0.0276205 0.0073969 0.0278342 0.1800184 0.00857 0.0621379 -0.0106178 0.0678861 0.0436179 0.0205727 -0.0113208 0.0205816 0.1791025 0.1062758 -0.0485687 0.0056898 -0.0067795 -0.0413837 0.0292493 -0.0000553 0.0289873 0.1752343 0.05677 0.0655616 -0.0104387 0.0360265 0.0124646 0.0276324 -0.0061371 0.0280652 0.2138652 unknown
polarizability: 200.8425247|-7.8292853|108.0662997|2.504244|-9.4292757|42.7853001 unknown
InChI: InChI=1S/C9H6ClFO/c10-6-5-9(12)7-1-3-8(11)4-2-7/h1-6H
charge 0 multiplicity 1
18 atoms
Cl -4.961899 1.217636 -0.19835
F  4.292278 0.633395 -0.040562
O  -1.585943 -1.887361 0.255968
C  0.181819 -0.261561 0.048183
C  0.62506 1.077174 -0.139648
C  1.152006 -1.291941 0.205409
C  2.000647 1.38491 -0.170626
C  2.527844 -1.005379 0.17796
C  -1.264162 -0.665545 0.091505
C  2.920395 0.333799 -0.01058
C  -2.315237 0.386323 -0.060434
C  -3.622756 0.028888 -0.026218
H  -0.087981 1.896729 -0.264756
H  0.791748 -2.315453 0.348667
H  2.358814 2.407987 -0.31457
H  3.283989 -1.786263 0.297543
H  -2.036904 1.434328 -0.197025
H  -3.964619 -1.000565 0.107534
