program: Gaussian 09
title: 000033198
version: EM64L-G09RevD.01
frameworkgroup: C1[X(C9H12O5)]
method: RPBEPBE
basis: SDD
operation: Freq
keyword: #pfreq=noraman
keyword: PBEPBE/SDD
title: #p freq=noraman PBEPBE/SDD
converged: YES YES NO NO
title: Mulliken charges:
elementType: O O O O O C C C C C C C C C H H H H H H H H H H H H
charge: -0.293919 -0.270445 -0.267157 -0.235748 -0.243467 -0.035876 -0.344608 -0.303871 0.263902 -0.270515 -0.232489 -0.263899 -0.670011 0.256414 0.249361 0.229166 0.222893 0.239648 0.252570 0.286196 0.233004 0.233210 0.286132 0.214166 0.232686 0.232655
chargesum: 0.00000
title: Mulliken charges with hydrogens summed into heavy atoms:
elementType: O O O O O C C C C C C C C C
charge: -0.293919 -0.270445 -0.267157 -0.235748 -0.243467 0.213486 0.107450 0.188347 0.263902 0.015681 0.233726 0.022233 0.009496 0.256414
polarizability: 1.97245292e+02 3.86451612e+00 1.02638097e+02 -1.42239984e+00 -1.66715026e-01 7.29538392e+01
1716.lowfreq: -8.3295 -0.0007 0.0005 0.0011 3.0628 4.8992 17.6484 34.2562 38.7856
frequency: 15.6690 34.2509 38.7640 52.5257 63.3414 91.7144 103.8118 123.4998 186.2411 207.2081 209.1472 234.4694 265.4967 275.9763 285.6919 349.4045 394.3982 419.2687 527.0348 609.9662 637.2245 717.2279 724.9780 760.3102 794.5096 798.1946 817.5985 883.6933 885.7316 919.1025 943.5739 959.7060 985.0462 1011.7690 1024.2628 1028.5361 1095.1527 1112.6368 1113.5377 1125.7596 1135.4504 1135.7220 1141.1792 1202.4821 1239.7938 1250.0351 1276.5557 1287.3007 1338.1346 1357.5202 1403.4716 1414.2540 1464.2871 1464.3455 1472.1207 1482.4797 1485.9762 1611.1737 1619.4865 1660.6338 2998.1080 3009.7240 3018.4409 3068.7641 3072.1214 3083.8446 3094.7233 3110.0619 3118.4427 3161.5007 3165.4468 3181.9032
redmass: 4.3537 4.4593 4.4500 4.3419 3.2547 3.9335 3.4906 4.1686 5.4977 1.9359 3.8761 3.8193 1.7567 4.8618 7.9371 3.8571 2.1809 4.5500 4.6211 4.2327 8.3734 7.0680 10.2452 7.0936 4.4094 1.1051 3.9584 1.6283 2.6383 2.1328 3.3174 3.9754 2.4561 1.0861 2.3872 1.4479 1.3935 1.3382 2.2913 2.6821 1.5535 2.7655 1.5539 1.2945 1.4453 1.1338 1.8754 1.4931 1.4384 1.4181 1.2621 2.0066 1.1221 1.0398 1.0652 1.1979 1.0645 11.1298 10.9981 6.6641 1.0360 1.0581 1.0574 1.1067 1.0533 1.1061 1.0985 1.1024 1.0931 1.0989 1.0868 1.1192
irintensity: 0.3896 0.3006 1.9265 3.1037 3.4729 0.2564 1.3756 1.2131 2.1307 3.6997 0.3522 8.6340 5.7829 42.3151 0.9092 3.6977 8.5599 10.7448 1.2308 0.0003 13.4843 2.3148 17.0039 4.7825 36.3230 3.8136 6.3764 0.3303 10.8555 0.0237 72.6916 45.0864 102.8264 59.5121 112.7888 6.1101 11.3387 11.9875 25.4923 340.3587 23.1618 152.2660 1.5648 2.4756 0.4139 0.0448 588.6733 4.5914 5.0486 3.6194 20.6357 2.2923 9.1374 12.4043 3.1341 4.0315 15.1772 229.6940 73.1153 0.7438 21.8058 14.8100 9.8673 8.7673 21.7374 9.8922 27.6081 40.6866 17.3529 0.0077 0.9028 28.4700
temp: 298.150 k
press: 1.00000 atm
elementType: 8 8 8 8 8 6 6 6 6 6 6 6 6 6 1 1 1 1 1 1 1 1 1 1 1 1
symmnumber: 1
zpe: 522480.5 jmol-1
zpe.correction: 0.199002 hartree
zpe.thermalcorrener: 0.214509 hartree
zpe.thermalcorrenthalpy: 0.215453 hartree
zpe.thermalcorrgfe: 0.152667 hartree
zpe.sumelectzpe: -725.132299 hartree
zpe.sumelectthermal: -725.116792 hartree
zpe.sumelectthermalent: -725.115848 hartree
zpe.sumelectthermalfe: -725.178635 hartree
dipole: 2.4916 -1.3476 0.3305
dipole: 2.8519
quadrupole: -73.1367 -89.8555 -78.2439
quadrupole: 10.8324 -1.4780 -1.5615
quadrupole: 7.2753 -9.4434 2.1681 10.8324 -1.4780 -1.5615
hfenergy: -725.3313015 hartree
pointgroup: C01 [X(C9H12O5)]
dipole: 0.9831751 -0.5350781 0.0774552 debye
dipolederiv: -0.6903673 0.1004424 -0.0565255 0.1230921 -0.4445713 -0.0213108 -0.0882902 -0.0234209 -0.3031299 -1.8408348 -0.3194536 -0.077903 -0.3675538 -0.5439468 -0.0567464 -0.1788788 -0.0753886 -0.2908724 -1.7836671 -0.2759957 -0.1053337 -0.3121775 -0.5417714 -0.0667015 -0.120101 -0.0657477 -0.299064 -0.7627593 0.0810337 0.0135422 -0.0800923 -0.8711279 -0.114971 -0.0438018 -0.1222568 -0.3340971 -0.7472797 0.0848536 0.0068342 -0.0688398 -0.8594232 -0.1223239 -0.0302382 -0.1138862 -0.3415619 0.3363258 0.0713666 0.0023132 0.0496298 0.2127805 0.0933357 0.1422591 0.0535774 0.2752332 0.1412665 -0.0606582 0.129862 0.0372879 0.2548355 0.0074386 0.0229523 0.0521578 0.2192494 0.9798642 0.0549319 -0.0284426 -0.173274 0.2007168 -0.0819595 0.0377955 -0.033168 0.2624044 2.1357749 0.1185705 0.0653988 0.2969141 1.1204585 0.1841069 0.1321817 0.1954664 0.291997 -0.5309694 0.095886 0.0142874 0.1497008 0.0014684 0.0326914 0.0217103 0.0285443 -0.1080633 1.0299215 0.0318674 0.0276065 -0.1039469 0.2344602 -0.028386 0.0010288 -0.024649 0.3478631 -0.4162738 0.0811277 0.010919 0.1789756 0.0122068 0.0271246 0.0281651 0.0277772 -0.0961612 -0.1167788 -0.0786361 -0.0221451 -0.0491713 0.0051638 -0.0129332 -0.0163556 -0.0136484 0.0546286 2.0111465 0.1034716 0.0743959 0.2502449 1.0867225 0.1940536 0.1166611 0.1850669 0.2873487 0.0323492 -0.0275697 0.0327261 -0.0525387 0.0562911 -0.0554413 0.0286739 -0.0702459 -0.0866677 0.0585253 -0.0739257 -0.0442388 -0.0926477 -0.1078661 -0.0044017 -0.0265293 -0.0313562 0.056669 0.115623 0.009334 -0.083012 -0.0115095 0.0332956 -0.0149089 -0.069366 0.0265314 -0.1051631 -0.0610187 0.0000019 0.0024091 0.0397012 0.0758179 -0.0163787 0.0203037 -0.0520989 -0.0795429 -0.0691529 -0.0464646 0.0300773 0.038609 -0.0186834 0.0832376 -0.006618 0.0840816 0.0245169 0.1164336 0.0030607 -0.0020109 0.0209616 0.0189386 -0.032164 0.0012159 -0.0319724 0.1642394 -0.0738572 -0.03887 0.0203484 0.0459367 -0.0372284 0.0949383 0.0016535 0.1031766 -0.0134745 -0.0717475 -0.020569 -0.0333928 0.0488699 0.0395671 -0.0681726 0.017173 -0.0811486 -0.0909836 0.1177874 0.0061091 -0.0017861 0.0252233 0.0172566 -0.0324197 0.0038874 -0.032708 0.1633428 -0.1471889 0.0706969 0.005985 0.0941419 0.0384335 -0.0134151 0.0105116 -0.0142185 0.1153068 0.1197003 0.0175694 -0.0236997 -0.046437 -0.0353996 0.105964 -0.0070785 0.1202765 -0.0147157 0.1171772 0.0118192 0.0417851 -0.0411 0.0516048 -0.0802564 0.0010844 -0.0907417 -0.099302 unknown
polarizability: 197.1945214|4.6089024|102.3352624|0.2489793|3.2972238|73.307445 unknown
InChI: InChI=1S/C9H12O5/c1-2-12-8(10)3-4-9(11)14-6-7-5-13-7/h3-4,7H,2,5-6H2,1H3
charge 0 multiplicity 1
26 atoms
O  -5.821332 0.034493 -0.127994
O  -2.060158 -0.120174 -0.204577
O  3.898337 0.277996 0.10408
O  -0.955584 1.882612 0.282728
O  2.787384 -1.726534 -0.366338
C  -4.42491 -0.366204 -0.545049
C  -5.167257 -1.201122 0.450236
C  -3.359111 0.608207 -0.103106
C  -0.914655 0.657961 0.013125
C  0.298494 -0.184241 -0.125214
C  5.207715 -0.439916 -0.002087
C  1.542046 0.345438 0.034238
C  6.298864 0.593524 0.252794
C  2.757408 -0.498176 -0.103687
H  -4.350387 -0.722179 -1.579927
H  -5.612137 -2.150097 0.129503
H  -4.905187 -1.126581 1.512947
H  -3.515922 0.936075 0.939886
H  -3.320013 1.504101 -0.748339
H  0.16351 -1.245429 -0.35948
H  5.211447 -1.258384 0.740567
H  5.271729 -0.890166 -1.009351
H  1.679195 1.406541 0.26832
H  7.291162 0.111588 0.186315
H  6.256209 1.404776 -0.493538
H  6.19525 1.037791 1.25725
