program: Gaussian 09
title: 000033237
version: EM64L-G09RevD.01
frameworkgroup: C1[X(C17H23N)]
method: RPBEPBE
basis: SDD
operation: Freq
keyword: #pfreq=noraman
keyword: PBEPBE/SDD
title: #p freq=noraman PBEPBE/SDD
converged: YES YES NO NO
title: Mulliken charges:
elementType: N C C C C C C C C C C C C C C C C C H H H H H H H H H H H H H H H H H H H H H H H
charge: -0.112713 -0.416583 -0.364943 -0.569436 0.426135 -0.316514 -0.312891 0.174971 0.397855 -0.464426 -0.676673 -0.674084 -0.382593 -0.462132 -0.242666 -0.437407 -0.270174 -0.245243 0.222226 0.212135 0.193845 0.201684 0.192408 0.248741 0.185202 0.209815 0.184532 0.201658 0.237511 0.222963 0.208289 0.207054 0.226161 0.205897 0.207154 0.236494 0.236597 0.223053 0.235534 0.224167 0.226398
chargesum: 0.00000
title: Mulliken charges with hydrogens summed into heavy atoms:
elementType: N C C C C C C C C C C C C C C C C C
charge: -0.112713 0.017778 0.030586 -0.128287 0.426135 0.078503 0.073299 0.174971 0.397855 -0.226915 -0.038367 -0.034872 -0.146099 -0.225535 -0.019613 -0.201873 -0.046006 -0.018845
polarizability: 2.44807916e+02 1.24725437e+01 2.16216613e+02 1.14689265e+01 1.06128424e+01 1.20981760e+02
1716.lowfreq: -15.7286 -9.8613 -5.8914 -0.0007 -0.0004 -0.0003 14.2280 23.0567 39.8291
frequency: 11.7267 22.8359 39.5514 60.0119 73.5017 75.9784 101.7139 158.5868 176.5241 179.2229 205.3236 219.9807 272.4969 287.3769 291.7117 311.0815 325.6392 420.8509 425.9637 428.8486 460.2236 468.5584 473.1452 506.2044 516.1963 556.0016 605.2963 653.4936 697.6230 709.4095 743.1173 780.7591 786.8522 790.4648 793.9431 801.7653 811.5569 840.4680 876.4715 880.3217 912.6403 920.3587 929.5890 958.8115 981.3063 989.8676 1000.3620 1024.0869 1035.4844 1051.2491 1063.2734 1072.8429 1079.6314 1083.1603 1087.2079 1110.4036 1133.6897 1150.2111 1171.6568 1180.3499 1194.6346 1208.0863 1236.3937 1243.6848 1249.6263 1270.6018 1274.7616 1282.2835 1294.2763 1300.1041 1338.6578 1358.5157 1364.2399 1373.0699 1377.6189 1384.4030 1386.8976 1404.8792 1415.8807 1440.9273 1454.5494 1456.6398 1462.2309 1462.7288 1472.1698 1475.6059 1478.3235 1486.5584 1489.3615 1496.7639 1517.4302 1589.3292 1597.0780 1631.8573 2844.4675 2848.5932 2862.8809 2977.4399 2982.2376 2983.2775 2985.7349 3016.9124 3029.2093 3033.2671 3034.9530 3056.3970 3074.8033 3076.5362 3088.9906 3090.4471 3115.8879 3117.9247 3125.7375 3128.9655 3146.0699 3152.2958 3161.5017
redmass: 3.9125 3.5505 3.5504 3.1388 3.5339 1.8544 2.1013 3.3030 2.1668 2.0093 1.2271 2.5093 2.8521 2.0121 2.5210 2.7627 2.0730 2.7522 3.1380 3.0473 2.5551 3.5856 3.2299 5.3879 4.2327 3.6442 3.7852 3.6086 2.4314 3.5226 1.2960 2.1346 1.6950 1.9217 1.1586 1.3808 1.6640 2.0476 3.1407 1.8071 1.7417 1.6008 1.9643 1.3789 1.3563 1.3543 2.4183 2.6408 2.3182 2.4530 2.4657 1.9611 2.2775 2.0168 2.4488 1.7885 1.3712 1.4278 1.1197 1.2122 1.9300 1.9833 1.8624 1.5674 1.4754 1.4315 1.3345 1.1977 1.2120 1.3859 1.4663 1.3280 1.3142 1.3714 2.2175 1.2343 1.2330 2.8107 5.4907 2.4571 2.5568 1.0613 1.0758 1.0574 1.0677 1.0613 1.0516 1.0731 1.0808 1.1261 3.5316 7.6135 5.3122 6.5462 1.0723 1.0718 1.0708 1.0619 1.0357 1.0360 1.0613 1.0901 1.0878 1.0873 1.0932 1.1007 1.0985 1.0979 1.1002 1.1002 1.0860 1.0860 1.0911 1.0881 1.0942 1.0992 1.1002
irintensity: 0.0062 0.0435 0.2791 0.0623 0.1305 0.3690 0.2299 0.7874 0.6940 1.9467 0.5850 0.7674 3.8840 0.6704 2.0227 0.6117 0.5645 0.8969 11.2973 1.7848 3.7672 6.4456 0.1696 0.7335 2.3498 4.8567 1.8460 0.5236 5.6785 5.6727 2.7506 4.3257 3.5912 69.5737 6.6940 12.1912 55.1352 1.1401 2.9616 2.6835 0.8703 0.8132 1.8119 1.9008 1.7078 1.1687 7.2385 8.8490 4.3705 19.8356 2.6995 13.3732 20.7437 1.1829 24.4449 14.7612 1.4156 1.1315 3.4214 0.0124 57.6418 14.9868 5.8057 6.0346 13.9231 8.5746 4.0138 9.6509 18.6248 5.0459 4.9486 11.2696 3.3766 0.8670 7.5535 20.6118 23.0908 6.6574 6.3596 2.9154 1.7684 3.0982 0.0590 6.8643 7.8097 7.0373 2.8240 15.5771 14.5275 11.5302 8.6960 6.1307 9.7176 0.4062 37.2181 44.1865 272.5852 4.6129 35.2394 23.1597 52.7145 11.0335 9.9582 19.7435 29.3836 32.4230 38.1518 87.0036 52.7754 40.5876 4.6924 0.9949 20.0339 6.4635 41.8463 43.5341 26.4181
temp: 298.150 k
press: 1.00000 atm
elementType: 7 6 6 6 6 6 6 6 6 6 6 6 6 6 6 6 6 6 1 1 1 1 1 1 1 1 1 1 1 1 1 1 1 1 1 1 1 1 1 1 1
symmnumber: 1
zpe: 934173.9 jmol-1
zpe.correction: 0.355808 hartree
zpe.thermalcorrener: 0.373868 hartree
zpe.thermalcorrenthalpy: 0.374812 hartree
zpe.thermalcorrgfe: 0.307176 hartree
zpe.sumelectzpe: -715.004127 hartree
zpe.sumelectthermal: -714.986066 hartree
zpe.sumelectthermalent: -714.985122 hartree
zpe.sumelectthermalfe: -715.052759 hartree
dipole: 1.2902 -0.4616 -0.7086
dipole: 1.5427
quadrupole: -99.2473 -101.6237 -114.8265
quadrupole: -0.7932 0.5370 0.9010
quadrupole: 5.9852 3.6088 -9.5940 -0.7932 0.5370 0.9010
hfenergy: -715.3599346 hartree
pointgroup: C01 [X(C17H23N1)]
dipole: 0.5072739 -0.1390704 -0.3028175 debye
polarizability: 244.5595988|12.1523799|213.4060806|10.7865043|20.62654|124.0406097 unknown
InChI: InChI=1S/C17H23N/c1-3-18(4-2)14-8-12-16-11-7-10-15-9-5-6-13-17(15)16/h5-7,9-11,13H,3-4,8,12,14H2,1-2H3
charge 0 multiplicity 1
41 atoms
N  3.632484 -0.146664 -0.297079
C  1.208089 -0.335332 -1.006014
C  2.619511 -0.965094 -1.017661
C  0.629273 -0.215282 0.431016
C  -0.734058 0.457446 0.473679
C  4.121366 0.995198 -1.117942
C  4.743288 -0.963091 0.26431
C  -1.947697 -0.263368 0.14881
C  -3.219989 0.436319 0.166963
C  -0.82734 1.817007 0.80526
C  4.658206 2.163614 -0.26898
C  4.336283 -1.753313 1.52299
C  -1.950676 -1.659604 -0.190149
C  -3.256711 1.829172 0.505029
C  -2.078919 2.50681 0.819937
C  -4.422169 -0.279496 -0.151837
C  -3.137125 -2.331514 -0.494598
C  -4.387051 -1.636203 -0.477826
H  0.539361 -0.95136 -1.639635
H  1.231714 0.670636 -1.468483
H  2.563002 -1.954313 -0.52505
H  2.930977 -1.156119 -2.076006
H  0.587049 -1.226983 0.882033
H  1.357693 0.3611 1.029209
H  4.905294 0.663253 -1.846409
H  3.272081 1.363364 -1.72229
H  5.163105 -1.663394 -0.503526
H  5.562916 -0.273483 0.536567
H  0.087902 2.364488 1.061759
H  3.868812 2.535196 0.407621
H  5.521674 1.86273 0.35166
H  4.988372 2.994918 -0.919807
H  3.97151 -1.062484 2.303095
H  3.532778 -2.482075 1.31279
H  5.201143 -2.315801 1.922001
H  -1.004494 -2.210186 -0.20355
H  -4.222158 2.349208 0.515099
H  -2.106113 3.569829 1.08445
H  -5.376097 0.261785 -0.132737
H  -3.114781 -3.397656 -0.746987
H  -5.311604 -2.172555 -0.71871
