program: Gaussian 09
title: 000033188
version: EM64L-G09RevD.01
frameworkgroup: C1[X(C15H10BrCl)]
method: RPBEPBE
basis: SDD
operation: Freq
keyword: #p
keyword: freq=noraman
keyword: PBEPBE/SDD
title: #p freq=noraman PBEPBE/SDD
converged: NO NO NO NO
title: Mulliken charges:
elementType: Br Cl C C C C C C C C C C C C C C C H H H H H H H H H H
charge: -0.048686 -0.024825 0.144120 0.292144 0.292217 0.606456 0.606379 -0.880320 -0.379178 -0.379268 -0.928683 -0.440728 -0.440708 -0.263278 -0.263194 -0.236223 -0.236235 0.250447 0.250540 0.297075 0.297014 0.271132 0.271127 0.234909 0.234908 0.236427 0.236430
chargesum: 0.00000
title: Mulliken charges with hydrogens summed into heavy atoms:
elementType: Br Cl C C C C C C C C C C C C C C C
charge: -0.048686 -0.024825 0.144120 0.292144 0.292217 0.606456 0.606379 -0.880320 -0.128730 -0.128729 -0.334593 -0.169596 -0.169581 -0.028369 -0.028287 0.000204 0.000194
polarizability: 2.51044596e+02 -1.72247297e-03 2.91021965e+02 7.29868183e+00 5.62538525e-04 8.81926451e+01
1716.lowfreq: -11.6609 -0.0012 0.0014 0.0019 5.6514 8.3363 41.3569 41.8535 80.4110
frequency: 41.2882 41.8512 80.4110 107.8701 130.5074 154.3722 228.9356 236.5606 244.7535 336.9661 366.5869 370.0853 390.5633 404.6539 420.6181 472.5228 501.7331 503.1163 564.2374 579.2387 604.7967 607.8485 654.0259 661.8766 719.5209 753.8281 769.2915 782.9142 811.1753 825.8883 874.8927 897.9738 899.1743 936.8155 938.7168 968.3811 969.4236 995.5160 995.9071 1032.7757 1037.5605 1058.9935 1109.6324 1122.4275 1175.6697 1178.6180 1189.8329 1201.2109 1242.1797 1273.9371 1298.5638 1334.6857 1343.8801 1379.2185 1394.7666 1430.8046 1442.6084 1449.7098 1472.8661 1505.9899 1541.0802 1557.7101 1561.4697 1620.7199 1631.6141 3096.3073 3136.4101 3136.4451 3150.5273 3151.4363 3164.2077 3166.5484 3171.2852 3176.5746 3177.5846
redmass: 8.8051 11.6314 7.3768 3.6515 4.8623 7.2650 12.8169 4.5426 6.1243 6.9309 2.7720 7.9410 3.7869 6.6901 5.4817 2.8258 5.2816 3.4200 5.3868 4.3437 7.0443 3.6667 5.9907 3.2318 5.9488 3.2440 1.3455 1.6473 2.3488 1.5385 1.6225 7.2417 4.3346 2.3560 4.0079 1.3596 1.3763 1.3373 1.3590 2.4299 2.0057 5.5047 2.4209 1.2304 1.3744 1.1221 1.1264 1.1610 1.3676 2.1894 1.9466 4.7786 4.9525 1.5448 5.5339 7.1881 2.7327 2.2846 1.7211 1.4739 6.4031 7.7217 7.4590 6.0887 5.9626 1.0584 1.0858 1.0857 1.0897 1.0892 1.0992 1.0953 1.1043 1.0994 1.0991
irintensity: 0.5436 0.8387 2.1657 0.0074 0.2685 3.2106 0.2874 0.0556 2.2025 3.4601 0.5088 28.4514 13.3055 1.4145 0.0075 0.2039 81.1822 0.0134 18.4561 0.0912 6.9006 4.1208 10.9520 15.4148 6.4198 0.2416 0.1509 161.9565 5.9480 2.9402 0.0511 95.7843 0.6351 2.4250 1.1656 0.0256 2.4691 0.0008 0.5996 0.7476 8.5947 47.1599 0.0343 1.9596 4.4954 2.3540 0.8019 91.1066 0.1268 48.0487 17.7751 1.9300 2.2851 0.3066 0.0325 11.1871 13.4328 21.7031 37.4220 4.9325 8.6671 29.7446 1.7254 4.0627 2.7251 14.3594 0.6811 6.4011 12.1032 5.9120 7.6388 19.1479 0.3116 46.2469 0.2627
temp: 298.150 k
press: 1.00000 atm
elementType: 35 17 6 6 6 6 6 6 6 6 6 6 6 6 6 6 6 1 1 1 1 1 1 1 1 1 1
symmnumber: 1
zpe: 526121.8 jmol-1
zpe.correction: 0.200389 hartree
zpe.thermalcorrener: 0.214104 hartree
zpe.thermalcorrenthalpy: 0.215048 hartree
zpe.thermalcorrgfe: 0.158090 hartree
zpe.sumelectzpe: -1049.980031 hartree
zpe.sumelectthermal: -1049.966316 hartree
zpe.sumelectthermalent: -1049.965372 hartree
zpe.sumelectthermalfe: -1050.022330 hartree
dipole: -0.8750 0.0004 1.6634
dipole: 1.8795
quadrupole: -119.9337 -93.7670 -118.4841
quadrupole: 0.0006 6.2474 0.0010
quadrupole: -9.2054 16.9613 -7.7559 0.0006 6.2474 0.0010
hfenergy: -1050.1804205 hartree
pointgroup: C01 [X(C15H10Br1Cl1)]
dipole: -0.0000919 0.2754345 -0.6862384 debye
polarizability: 291.0219639|-0.005919|250.8240935|0.0062872|-9.4409495|88.4131485 unknown
InChI: InChI=1S/C15H10BrCl/c16-9-14-10-5-1-3-7-12(10)15(17)13-8-4-2-6-11(13)14/h1-8H,9H2
charge 0 multiplicity 1
27 atoms
Br -0.000323 -3.880891 1.071181
Cl 0.00059 3.42967 0.233826
C  -0.000164 -1.219052 -0.315218
C  -1.241638 -0.514982 -0.184732
C  1.241576 -0.515352 -0.18475
C  -1.249674 0.937785 -0.011936
C  1.249982 0.93743 -0.01195
C  0.000256 1.60386 0.048448
C  -2.516074 -1.190566 -0.202004
C  2.515896 -1.191201 -0.201824
C  -0.000588 -2.676389 -0.629548
C  -2.509809 1.629179 0.087813
C  2.510261 1.628546 0.087835
C  -3.713865 -0.493063 -0.090539
C  3.713836 -0.493963 -0.090311
C  -3.712277 0.935397 0.045104
C  3.712573 0.934505 0.045228
H  -2.544272 -2.281932 -0.26675
H  2.543932 -2.282568 -0.266392
H  0.895508 -3.016249 -1.161661
H  -0.897263 -3.015793 -1.16101
H  -2.499179 2.715915 0.205054
H  2.499856 2.71529 0.205058
H  -4.665258 -1.035511 -0.095888
H  4.665107 -1.036625 -0.095521
H  -4.662041 1.474232 0.126203
H  4.662453 1.473127 0.126383
