program: Gaussian 09
title: 000033202
version: EM64L-G09RevD.01
frameworkgroup: C1[X(C15H26N2O)]
method: RPBEPBE
basis: SDD
operation: Freq
keyword: #p
keyword: freq=noraman
keyword: PBEPBE/SDD
title: #p freq=noraman PBEPBE/SDD
converged: YES YES NO NO
title: Mulliken charges:
elementType: O N N C C C C C C C C C C C C C C C H H H H H H H H H H H H H H H H H H H H H H H H H H
charge: -0.273945 -0.110846 -0.698154 -0.387889 -0.245324 -0.323757 -0.327141 -0.398215 -0.238086 -0.567503 0.520740 -0.671910 -0.672251 -0.401487 -0.400943 -0.413753 -0.414066 0.480135 0.211044 0.216535 0.198998 0.178806 0.202458 0.188261 0.207132 0.188268 0.222084 0.222941 0.198709 0.196608 0.179257 0.179840 0.212132 0.225339 0.204562 0.207761 0.225549 0.205172 0.224838 0.224857 0.210692 0.210664 0.300942 0.300944
chargesum: 0.00000
title: Mulliken charges with hydrogens summed into heavy atoms:
elementType: O N N C C C C C C C C C C C C C C C
charge: -0.273945 -0.110846 -0.096268 0.039690 0.132480 0.066962 0.068259 0.046810 0.121012 -0.172186 0.520740 -0.029877 -0.033768 -0.176650 -0.176086 -0.203061 -0.203402 0.480135
polarizability: 2.49288081e+02 -1.41721148e+01 1.68857986e+02 2.31710131e+01 1.02779733e+01 1.40851659e+02
1716.lowfreq: -16.5989 -14.4223 -7.2884 -2.6212 -0.0008 -0.0006 0.0006 5.9260 25.9123
frequency: -14.2485 -9.4105 25.8282 29.1768 53.9578 63.0460 71.2977 85.3010 93.6734 120.1990 128.3698 145.6402 171.9358 196.1468 220.8596 253.0753 291.2100 292.7093 295.2757 313.9127 337.3490 359.0957 371.2471 391.9548 409.0456 412.5100 438.0706 476.0809 490.9393 515.6106 549.9860 639.4400 725.1015 744.1455 761.8695 769.9595 792.4347 794.5216 804.6929 815.8989 822.3450 833.9006 858.1625 913.2368 926.8126 933.9886 950.8671 988.2447 1000.2798 1010.3227 1031.9649 1039.9004 1059.0396 1064.4251 1066.9189 1075.3023 1079.4128 1084.4654 1101.5724 1122.7878 1132.2114 1155.3383 1171.5089 1187.0649 1206.8590 1219.1570 1230.6359 1255.5194 1257.7768 1271.9948 1276.1707 1287.4277 1289.8509 1309.8802 1318.6897 1319.5431 1333.6403 1360.6215 1362.1123 1371.8919 1384.9754 1385.5761 1386.8107 1407.3572 1432.4775 1460.9819 1462.2834 1468.1591 1470.0726 1471.9590 1477.9449 1482.3554 1485.8901 1487.9127 1491.0366 1493.4661 1519.6140 1582.8602 1632.9853 1644.5025 2849.0224 2858.4404 2898.0765 2910.5895 2922.7840 2944.0633 2967.5007 2980.0685 2981.7580 2983.2109 3001.6088 3016.3166 3020.8022 3031.5679 3058.1081 3066.5986 3074.6350 3076.0868 3090.6853 3090.8894 3104.4271 3106.2354 3127.1025 3134.2477 3569.6073 3710.1561
redmass: 3.4420 3.7658 4.4642 3.4776 3.1691 3.0658 1.9256 2.0840 2.9965 2.3125 3.3631 2.9823 2.1516 2.1505 1.3061 1.8941 2.0203 2.4322 2.6104 1.2423 3.0756 1.0491 4.1625 2.5239 2.6701 3.5209 2.8849 2.9772 3.3795 3.6180 2.6317 6.6126 3.3600 2.7840 1.1077 3.5557 1.1858 1.1329 1.1932 1.2597 2.1449 3.8139 1.2503 2.0601 4.5351 1.4169 1.3584 2.3290 2.8467 1.4688 4.2073 4.6100 1.4511 2.8807 1.7169 2.0446 2.9237 2.1382 2.8490 1.6615 1.2474 1.2658 1.3388 1.0963 2.2493 2.2627 1.6861 1.3034 1.3133 1.0991 1.1146 1.2135 1.2409 2.9385 1.3133 1.2564 1.4892 1.3352 1.3722 1.3898 5.4043 1.2355 1.2326 1.4783 3.2015 1.0559 1.0540 1.0753 1.0624 1.0781 1.0714 1.0708 1.0667 1.0798 1.0757 1.0847 3.1185 6.6475 1.8325 2.1196 1.0720 1.0713 1.0544 1.0703 1.0580 1.1055 1.0590 1.1003 1.0368 1.0359 1.0595 1.1012 1.0875 1.0872 1.0917 1.1045 1.0983 1.0981 1.1004 1.1004 1.0866 1.0865 1.0962 1.0971 1.0448 1.1040
irintensity: 0.0084 0.1830 0.4680 0.1402 0.6658 0.2279 1.9903 0.0530 1.0479 0.8608 6.5319 2.2929 1.5293 0.2904 0.1632 3.0416 2.5504 3.4953 15.0512 296.7031 6.0574 1.7905 3.6432 1.1146 0.0386 10.8971 5.3931 4.4083 7.2459 12.8037 17.3745 0.1812 0.7109 8.7556 2.5634 6.4295 8.7189 3.8292 3.2262 0.0353 58.1899 22.3350 0.0457 1.6384 12.4258 0.2810 0.0260 4.9931 0.0279 0.0990 4.3507 84.9410 3.4160 138.1523 44.8263 33.6498 16.6525 2.6890 12.7802 3.5900 17.6303 8.7361 3.8915 15.4086 33.0967 0.2306 21.1345 2.0477 1.3877 0.0191 0.8533 19.6199 24.7332 66.7682 9.2951 0.6927 7.4557 2.6967 1.2157 19.0393 8.9466 21.6044 23.0529 2.7599 0.2938 1.0404 8.3882 5.4245 1.4695 4.0152 5.7896 13.3892 8.4515 3.8606 15.1330 6.2171 149.3412 3.2906 2.3847 265.8936 34.5377 174.6007 51.8766 58.8190 101.8518 56.2744 44.9044 41.6836 45.1093 32.2282 30.5321 10.6975 17.2554 21.5353 31.7982 44.4764 43.3666 78.1638 28.9897 59.1544 0.5303 42.2930 54.2987 2.6411 65.7981 18.8096
temp: 298.150 k
press: 1.00000 atm
elementType: 8 7 7 6 6 6 6 6 6 6 6 6 6 6 6 6 6 6 1 1 1 1 1 1 1 1 1 1 1 1 1 1 1 1 1 1 1 1 1 1 1 1 1 1
symmnumber: 1
zpe: 1010469.0 jmol-1
zpe.correction: 0.384867 hartree
zpe.thermalcorrener: 0.404426 hartree
zpe.thermalcorrenthalpy: 0.405371 hartree
zpe.thermalcorrgfe: 0.335352 hartree
zpe.sumelectzpe: -770.463584 hartree
zpe.sumelectthermal: -770.444025 hartree
zpe.sumelectthermalent: -770.443081 hartree
zpe.sumelectthermalfe: -770.513100 hartree
dipole: -1.3043 -0.0761 -0.3702
dipole: 1.3580
quadrupole: -80.2437 -105.1086 -111.7619
quadrupole: -6.1454 6.9949 2.9230
quadrupole: 18.7944 -6.0705 -12.7239 -6.1454 6.9949 2.9230
hfenergy: -770.8484515 hartree
pointgroup: C01 [X(C15H26N2O1)]
dipole: -0.5142569 0.0000976 0.1448849 debye
polarizability: 249.3286891|18.5341134|164.6454999|-19.6267113|14.5140438|145.0235372 unknown
InChI: InChI=1S/C15H26N2O/c1-3-17(4-2)11-13-18-12-5-6-14-7-9-15(16)10-8-14/h7-10H,3-6,11-13,16H2,1-2H3
charge 0 multiplicity 1
44 atoms
O  1.467296 0.055162 0.151685
N  5.206232 -0.112762 0.311972
N  -7.258555 -0.863658 0.910973
C  3.788904 -0.385872 0.663237
C  2.835488 0.333142 -0.301735
C  6.099203 -1.286543 0.496252
C  5.724361 1.128497 0.94741
C  -0.927085 0.260846 -0.187031
C  0.452596 0.676288 -0.706208
C  -2.079541 0.88801 -1.02023
C  -3.455437 0.450402 -0.538985
C  5.912405 -2.35512 -0.59778
C  6.872873 1.77909 0.152252
C  -4.076926 -0.717253 -1.051282
C  -4.147023 1.166248 0.471597
C  -5.329278 -1.159529 -0.580187
C  -5.40004 0.741293 0.956921
C  -6.013728 -0.43484 0.437624
H  3.543032 -0.083278 1.707982
H  3.59098 -1.469927 0.595083
H  2.992169 -0.043379 -1.335581
H  3.025303 1.430495 -0.30406
H  7.143217 -0.925329 0.458191
H  5.962517 -1.751651 1.505967
H  4.886467 1.848309 1.007734
H  6.052785 0.940663 2.001764
H  -1.022378 0.563544 0.872687
H  -1.005031 -0.842275 -0.211027
H  -1.995018 1.992463 -0.972726
H  -1.944956 0.605629 -2.083956
H  0.590637 0.342663 -1.761155
H  0.564953 1.785526 -0.685233
H  4.883518 -2.75864 -0.605257
H  6.113274 -1.918526 -1.591656
H  6.603794 -3.203066 -0.433881
H  7.750094 1.111561 0.073985
H  6.536735 2.017864 -0.871853
H  7.205566 2.71182 0.645363
H  -3.571938 -1.292773 -1.838075
H  -3.69766 2.077738 0.886978
H  -5.785254 -2.065004 -1.000532
H  -5.911013 1.320077 1.736899
H  -7.692854 -1.705117 0.544815
H  -7.742787 -0.35009 1.640658
