program: Gaussian 09
title: 000033192
version: EM64L-G09RevD.01
frameworkgroup: C1[X(C15H10N2O5)]
method: RPBEPBE
basis: SDD
operation: Freq
keyword: #p
keyword: freq=noraman
keyword: PBEPBE/SDD
title: #p freq=noraman PBEPBE/SDD
converged: YES YES NO NO
title: Mulliken charges:
elementType: O O O O O N N C C C C C C C C C C C C C C C H H H H H H H H H H
charge: -0.225068 -0.199100 -0.195929 -0.201721 -0.200279 0.028821 0.028755 0.319431 0.512183 0.100638 -0.264641 -0.313367 -0.328080 -0.351658 -0.367754 0.382125 -0.292572 0.377832 -0.376863 -0.364742 -0.368272 -0.371737 0.279134 0.231246 0.292134 0.237243 0.253646 0.212923 0.290211 0.292353 0.290554 0.292551
chargesum: 0.00000
title: Mulliken charges with hydrogens summed into heavy atoms:
elementType: O O O O O N N C C C C C C C C C C C C C C C
charge: -0.225068 -0.199100 -0.195929 -0.201721 -0.200279 0.028821 0.028755 0.319431 0.512183 0.100638 0.014494 -0.082121 -0.035946 -0.114415 -0.114108 0.382125 -0.079649 0.377832 -0.086652 -0.072389 -0.077717 -0.079186
polarizability: 4.64567164e+02 -7.03159517e+00 2.12039022e+02 4.05355127e+00 -1.47550324e+00 7.31734598e+01
1716.lowfreq: -2.1588 -0.0011 -0.0007 -0.0005 1.5482 3.7748 11.5021 20.2054 34.2222
frequency: 11.5016 20.1809 34.2149 52.8748 61.7537 63.6249 77.8447 114.0556 135.7041 164.3615 165.0708 205.3951 250.1670 263.4309 291.0934 322.4225 347.5736 406.1916 409.9819 410.3660 453.3932 482.9052 490.4683 494.3629 514.2269 535.8292 618.1111 624.3741 628.2924 647.2861 663.3801 680.5661 683.5671 737.9363 751.9051 768.7659 785.9847 810.8672 844.0368 846.3923 857.6748 880.9679 885.2551 901.5402 986.8096 990.6383 997.1656 1002.1916 1002.7115 1016.5189 1018.6822 1028.4877 1091.6868 1093.5255 1109.6143 1114.5929 1180.9850 1184.2767 1207.5807 1217.1739 1221.4051 1224.8232 1288.0555 1299.9660 1316.9205 1332.8950 1366.3311 1368.5846 1402.5799 1403.8049 1410.6421 1420.6476 1476.0710 1483.1894 1522.0434 1585.5375 1594.0114 1605.8635 1607.3972 1635.4864 3101.9828 3145.8751 3149.4035 3155.2633 3163.7111 3164.7834 3184.8528 3185.3167 3187.2501 3188.0759
redmass: 5.1197 6.5582 9.5941 9.2304 7.3465 7.3038 7.2854 5.1863 5.2323 4.6134 9.4686 9.1867 6.1464 6.1196 10.5437 4.3107 6.8332 2.8345 2.8418 8.3322 3.8825 7.6409 4.7570 4.6073 6.4270 4.8270 8.0220 7.1165 7.1526 5.1334 4.4562 4.3443 5.5325 4.0481 8.9896 4.0112 9.4133 7.5280 1.2999 1.3339 1.6071 3.7436 1.7141 1.9345 1.3634 1.3398 1.3684 3.4526 3.0581 1.3799 1.2616 3.1988 3.1866 3.1946 1.3363 1.3286 1.3075 1.4885 3.8747 2.9202 4.9851 1.7867 1.3211 1.5938 1.8002 1.5213 6.7410 7.0575 11.3396 7.5159 4.0554 3.5473 2.3557 2.4648 10.7824 7.4369 7.7660 6.1349 6.3353 5.6039 1.0897 1.0910 1.0908 1.0894 1.0891 1.0885 1.0948 1.0952 1.0959 1.0966
irintensity: 0.0912 0.5693 1.3566 1.7677 0.2413 0.6075 7.3387 1.6579 2.5092 0.1311 1.2789 5.6879 0.1549 0.1398 2.4938 1.4132 14.0365 0.1431 0.0325 1.8104 1.0866 9.7595 9.0138 11.2714 1.4360 2.5372 7.3696 1.3222 1.0146 2.1063 42.7272 9.0216 3.2728 12.4324 114.9890 0.5037 12.1574 15.9849 4.8413 19.4068 88.4231 8.4658 13.9259 4.0701 15.3853 8.0519 0.2427 28.8652 11.2952 4.9801 28.2847 93.2306 16.0844 20.3771 6.8060 29.8245 9.7034 124.9241 878.0865 103.4259 44.5480 74.3890 0.3424 48.2772 144.3035 32.8109 77.4367 152.5761 3.3797 16.1330 63.3933 60.7046 2.1062 17.5861 202.7347 22.1816 12.9537 16.4581 19.7039 214.0633 0.2424 4.2849 1.8717 6.5718 9.3170 9.3288 0.1260 1.0215 2.6657 2.0968
temp: 298.150 k
press: 1.00000 atm
elementType: 8 8 8 8 8 7 7 6 6 6 6 6 6 6 6 6 6 6 6 6 6 6 1 1 1 1 1 1 1 1 1 1
symmnumber: 1
zpe: 585161.2 jmol-1
zpe.correction: 0.222876 hartree
zpe.thermalcorrener: 0.241553 hartree
zpe.thermalcorrenthalpy: 0.242498 hartree
zpe.thermalcorrgfe: 0.171546 hartree
zpe.sumelectzpe: -1061.511710 hartree
zpe.sumelectthermal: -1061.493033 hartree
zpe.sumelectthermalent: -1061.492088 hartree
zpe.sumelectthermalfe: -1061.563040 hartree
dipole: 0.6200 1.1127 0.0640
dipole: 1.2754
quadrupole: -206.1349 -129.3876 -127.0641
quadrupole: 3.4703 0.9644 -0.4499
quadrupole: -51.9394 24.8079 27.1314 3.4703 0.9644 -0.4499
hfenergy: -1061.734586 hartree
pointgroup: C01 [X(C15H10N2O5)]
dipole: 0.2425754 0.4388923 0.0179365 debye
polarizability: 464.5299335|-6.1974336|211.8842456|6.8545141|-4.3235434|73.3654671 unknown
InChI: InChI=1S/C15H10N2O5/c18-15(12-4-8-14(9-5-12)17(21)22)10-3-11-1-6-13(7-2-11)16(19)20/h1-10H
charge 0 multiplicity 1
32 atoms
O  -1.191721 2.713261 -0.012202
O  -6.488041 -2.393622 0.155566
O  -7.451464 -0.357652 -0.208474
O  6.710301 -2.218399 -0.037448
O  7.57178 -0.108624 0.098875
N  -6.425359 -1.117024 -0.023351
N  6.582302 -0.935149 0.032017
C  -2.539771 0.719408 -0.007198
C  2.593591 0.682703 0.04098
C  -1.212212 1.439131 -0.002958
C  1.260277 1.293185 0.046387
C  -2.674201 -0.683037 0.1850
C  -3.708939 1.506783 -0.198367
C  2.809594 -0.726897 -0.035243
C  3.730884 1.541255 0.113213
C  -5.080853 -0.478837 -0.016372
C  0.04957 0.651915 0.000864
C  5.207766 -0.374393 0.035366
C  -3.944664 -1.290283 0.184703
C  -4.984047 0.917702 -0.207749
C  4.107291 -1.260153 -0.038427
C  5.038286 1.024702 0.111296
H  1.219468 2.391627 0.090413
H  -1.797777 -1.314802 0.353428
H  -3.583309 2.585329 -0.334061
H  1.957121 -1.410577 -0.095138
H  3.578154 2.624716 0.170973
H  -0.009014 -0.439552 -0.050035
H  -4.071676 -2.36523 0.335776
H  -5.892994 1.505833 -0.357064
H  4.290682 -2.336082 -0.096729
H  5.917175 1.671963 0.165959
