program: Gaussian 09
title: 000033173
version: EM64L-G09RevD.01
frameworkgroup: C1[X(C4H5Cl)]
method: RPBEPBE
basis: SDD
operation: Freq
keyword: #pfreq=noraman
keyword: PBEPBE/SDD
title: #p freq=noraman PBEPBE/SDD
converged: YES YES NO YES
title: Mulliken charges:
elementType: Cl C C C C H H H H H
charge: -0.082922 -0.623701 -0.174067 0.184860 -0.580249 0.272561 0.273334 0.250790 0.238223 0.241172
chargesum: 0.00000
title: Mulliken charges with hydrogens summed into heavy atoms:
elementType: Cl C C C C
charge: -0.082922 -0.077806 0.076723 0.184860 -0.100854
polarizability: 9.13549819e+01 -7.07778578e+00 4.00603368e+01 -8.29924573e+00 1.14495217e+00 3.31116315e+01
1716.lowfreq: -2.6733 -2.4639 0.0033 0.0039 0.0042 19.5972 71.4859 188.7844 261.1978
frequency: 71.3819 188.7822 261.1948 335.3084 487.9528 559.5656 658.0641 864.1722 881.9833 896.6704 989.8476 1008.9552 1135.3962 1152.1024 1245.0952 1339.9090 1435.6621 1452.0706 2000.2772 3067.1888 3081.2935 3112.3808 3160.2177 3175.4504
redmass: 4.2223 2.9029 3.2968 2.1561 3.3987 2.3826 2.8443 1.7077 1.3126 1.2677 1.5198 2.1385 1.1604 1.8355 1.1365 1.3992 1.3677 1.1854 9.8113 1.0574 1.0611 1.0892 1.1111 1.1129
irintensity: 0.5325 2.4802 10.7106 12.5568 10.2064 26.8403 59.8977 16.2348 87.6915 30.9192 2.5087 4.9165 0.6271 18.5007 22.8853 7.5386 5.7067 6.6935 83.5524 19.6364 0.7078 2.2530 7.8628 3.4002
temp: 298.150 k
press: 1.00000 atm
elementType: 17 6 6 6 6 1 1 1 1 1
symmnumber: 1
zpe: 194757.6 jmol-1
zpe.correction: 0.074179 hartree
zpe.thermalcorrener: 0.080104 hartree
zpe.thermalcorrenthalpy: 0.081048 hartree
zpe.thermalcorrgfe: 0.044123 hartree
zpe.sumelectzpe: -615.041902 hartree
zpe.sumelectthermal: -615.035977 hartree
zpe.sumelectthermalent: -615.035033 hartree
zpe.sumelectthermalfe: -615.071959 hartree
dipole: 2.2881 1.2172 -0.5822
dipole: 2.6563
quadrupole: -36.9996 -35.3611 -36.4143
quadrupole: -2.9495 -0.9539 -0.0549
quadrupole: -0.7413 0.8972 -0.1559 -2.9495 -0.9539 -0.0549
hfenergy: -615.1160814 hartree
pointgroup: C01 [X(C4H5Cl1)]
dipole: 0.831081 0.4982175 -0.3915112 debye
dipolederiv: -0.7173085 -0.1361074 0.0513494 -0.3817869 -0.3075648 0.0520508 0.1682936 0.0835558 -0.241813 0.9534806 0.2257881 -0.124419 0.4608855 0.3774093 -0.1286465 0.0068293 -0.1674282 0.2438202 -0.4669899 -0.0162246 0.0717677 0.1327348 -0.2094552 0.1529683 0.0044597 0.2032823 -0.000204 0.5937262 -0.2185166 -0.1422918 -0.3983058 -0.0229717 0.0421952 -0.2698339 0.0247428 -0.0730373 -0.4318558 0.0679195 -0.0837718 0.1517668 -0.0001029 -0.1989591 -0.0389767 -0.2062519 -0.2712274 0.0294786 -0.0291998 0.0939445 -0.0510821 0.0432917 -0.0408867 0.0196007 -0.030111 -0.0592861 -0.0905907 0.0338139 0.0040443 0.0011919 -0.082231 0.0623003 0.0098717 0.045032 0.0854074 0.0431263 0.0489745 0.0158471 0.0423003 0.12882 -0.0880154 -0.0367019 -0.098984 0.0099762 0.0138114 -0.0303036 0.0875461 -0.0339632 0.0723818 0.0768569 0.0824986 0.0723586 0.1387366 0.0731218 0.0538559 0.0259835 0.0762586 0.0004226 0.0701362 0.0539588 0.0738035 0.1676274 unknown
polarizability: 90.9999777|-4.1351461|39.1180011|-11.3448785|-0.5948405|34.4089714 unknown
InChI: InChI=1S/C4H5Cl/c1-2-3-4-5/h3H,1,4H2
charge 0 multiplicity 1
10 atoms
Cl -2.465888 -0.690917 0.377186
C  -1.164464 0.448291 -0.4617
C  0.039801 0.605017 0.416663
C  1.241068 0.113391 0.106551
C  2.436212 -0.369322 -0.212361
H  -0.93791 -0.03387 -1.421673
H  -1.713149 1.390624 -0.604333
H  -0.09889 1.152857 1.358439
H  3.158078 0.216908 -0.794717
H  2.745041 -1.37448 0.101145
