program: Gaussian 09
title: 000033201
version: EM64L-G09RevD.01
frameworkgroup: C1[X(C14H24N2O)]
method: RPBEPBE
basis: SDD
operation: Freq
keyword: #p
keyword: freq=noraman
keyword: PBEPBE/SDD
title: #p freq=noraman PBEPBE/SDD
converged: YES YES NO NO
title: Mulliken charges:
elementType: O N N C C C C C C C C C C C C C C H H H H H H H H H H H H H H H H H H H H H H H H
charge: -0.279300 -0.113358 -0.732373 -0.365431 -0.325475 -0.318794 -0.229303 -0.249663 -0.550162 -0.670185 -0.689882 0.519941 -0.594724 -0.508127 0.497450 -0.187038 -0.450136 0.183153 0.223786 0.187650 0.197541 0.184499 0.203757 0.183807 0.187519 0.192165 0.191145 0.198437 0.232272 0.219561 0.231674 0.204914 0.203004 0.234025 0.213043 0.298087 0.224970 0.211963 0.211981 0.292465 0.335140
chargesum: 0.00000
title: Mulliken charges with hydrogens summed into heavy atoms:
elementType: O N N C C C C C C C C C C C C C C
charge: -0.279300 -0.113358 -0.104768 0.041509 0.059716 0.069462 0.142023 0.133647 -0.119453 -0.014036 -0.039809 0.519941 -0.296638 -0.283158 0.497450 0.024926 -0.238156
polarizability: 2.01147508e+02 -5.56593751e+00 1.88064625e+02 9.16344894e-01 1.93479882e+00 1.23488079e+02
1716.lowfreq: -7.1860 -0.0009 0.0003 0.0007 5.5581 9.2621 23.9723 30.5142 42.2640
frequency: 23.9446 30.2519 42.1873 55.3959 66.6070 87.4142 108.1932 133.2179 153.2933 181.1828 193.3658 206.2686 220.0654 243.8180 261.3875 283.8970 287.3464 301.1653 323.8722 352.2814 392.0076 433.1256 438.8218 451.7243 463.8040 473.9276 518.4160 531.8084 534.4709 616.9411 704.7284 708.1433 716.7900 770.0838 789.5834 793.3902 800.2513 859.5560 884.5216 901.8307 914.4312 923.7443 936.9744 956.2459 982.2523 989.7077 1002.1882 1018.4594 1039.6084 1047.7497 1061.2573 1073.3732 1085.4994 1085.9030 1091.1389 1100.2701 1119.2622 1165.2695 1174.6627 1179.9240 1196.8284 1198.0027 1225.9176 1237.7732 1277.4156 1285.5358 1291.5350 1300.9887 1326.1135 1334.2784 1352.7396 1357.3806 1364.1638 1374.8091 1386.6737 1393.6147 1396.0413 1397.5038 1442.6494 1453.4826 1460.3491 1465.6902 1467.8093 1471.9174 1474.4913 1477.5526 1482.3917 1487.4353 1492.0293 1494.0827 1595.3407 1625.0628 1634.0181 2844.2737 2852.1241 2870.1823 2914.2274 2926.3480 2965.6544 2969.7990 2979.2566 2986.5280 2987.8075 3020.5872 3029.1448 3035.4885 3062.2960 3071.1418 3079.9378 3086.2514 3091.2113 3108.2459 3121.2934 3132.6236 3145.1814 3551.5630 3699.8794
redmass: 3.6066 3.4849 4.4999 3.2458 3.8366 1.8143 2.1876 3.1726 3.6962 3.9552 1.3838 1.3487 3.4422 2.8388 1.9435 2.7177 1.8511 2.3336 1.1905 2.3726 2.8650 2.0418 2.0814 1.2361 2.5665 3.0718 3.7142 3.3844 4.0929 3.7139 1.8660 2.7775 4.6413 2.1286 1.9653 1.1700 1.1486 1.4398 2.1404 2.3754 1.9576 1.9904 1.5026 1.3294 5.9160 1.8646 2.6565 1.9446 2.6239 1.6465 2.5234 1.9249 2.2489 2.2388 2.9004 1.5798 1.9105 1.4792 1.2826 1.2920 2.0480 1.3628 1.3061 1.1864 1.1251 1.2358 1.2300 1.5424 1.5848 1.2515 1.8140 1.3751 1.3367 1.3794 1.2359 5.9287 1.3278 1.3279 1.2011 1.0737 1.1684 1.1406 1.6403 1.0880 1.0647 1.0529 1.1915 1.0959 1.0959 2.2854 6.1697 2.8287 1.4828 1.0722 1.0717 1.0698 1.0570 1.0563 1.1040 1.0817 1.0358 1.0365 1.0855 1.0869 1.0868 1.0981 1.0875 1.0982 1.0984 1.1003 1.1000 1.0851 1.0913 1.0922 1.0993 1.0448 1.1040
irintensity: 0.0713 0.1973 0.1254 0.4309 0.3538 0.3978 0.7612 3.4168 4.9560 10.2691 4.9420 3.5871 3.5430 4.1322 1.0169 4.5563 1.6899 2.6582 211.3759 1.5711 2.8746 7.8081 5.0803 43.3629 5.7487 6.0377 1.2281 7.3009 0.3628 1.1414 28.0140 15.5018 3.2771 31.6720 25.0656 5.6451 2.6453 1.0066 13.0362 7.8094 1.1875 2.2688 21.1756 0.1102 4.9088 9.4742 30.0205 8.9944 48.3081 5.3261 42.1096 12.0284 26.1342 8.6783 29.1698 27.1855 5.3175 7.6878 2.5905 4.8069 19.0455 6.5475 12.1507 13.8023 4.6471 9.6027 19.4274 21.9002 16.6745 35.8057 7.9850 5.0514 4.2193 0.2724 18.1721 9.9739 10.0303 6.0374 4.2372 2.5638 2.8628 5.3325 37.6512 13.2120 9.6226 10.1728 17.4658 6.3698 12.9787 38.0849 35.5983 39.2080 220.9556 33.4456 125.9688 178.3169 63.9704 153.8530 78.1987 3.4465 21.5470 24.6129 91.3529 15.5474 21.1613 29.8431 15.8082 54.2201 46.1783 48.4942 39.6471 4.3995 33.6901 5.2218 43.1970 60.9154 35.1735
temp: 298.150 k
press: 1.00000 atm
elementType: 8 7 7 6 6 6 6 6 6 6 6 6 6 6 6 6 6 1 1 1 1 1 1 1 1 1 1 1 1 1 1 1 1 1 1 1 1 1 1 1 1
symmnumber: 1
zpe: 939305.8 jmol-1
zpe.correction: 0.357763 hartree
zpe.thermalcorrener: 0.377012 hartree
zpe.thermalcorrenthalpy: 0.377956 hartree
zpe.thermalcorrgfe: 0.309200 hartree
zpe.sumelectzpe: -731.242122 hartree
zpe.sumelectthermal: -731.222873 hartree
zpe.sumelectthermalent: -731.221929 hartree
zpe.sumelectthermalfe: -731.290684 hartree
dipole: 3.2221 -0.2657 -1.3103
dipole: 3.4884
quadrupole: -100.1444 -91.3188 -107.5229
quadrupole: -1.4603 0.1087 -2.2563
quadrupole: -0.4824 8.3432 -7.8609 -1.4603 0.1087 -2.2563
hfenergy: -731.5998849 hartree
pointgroup: C01 [X(C14H24N2O1)]
dipole: 1.1886375 -0.1806073 -0.6619344 debye
polarizability: 199.1753669|-5.96046|188.3156129|-7.2969902|8.9598943|125.2092318 unknown
InChI: InChI=1S/C14H24N2O/c1-3-16(4-2)9-11-17-10-8-13-6-5-7-14(15)12-13/h5-7,12H,3-4,8-11,15H2,1-2H3
charge 0 multiplicity 1
41 atoms
O  0.804496 2.082179 0.317362
N  2.654514 -0.355759 -0.293235
N  -0.932928 -2.469446 -0.106022
C  2.975863 1.081067 -0.059125
C  3.219233 -1.234826 0.772609
C  3.071508 -0.780732 -1.660875
C  1.926074 2.047925 -0.623093
C  -0.385564 2.774868 -0.206636
C  -1.582257 2.413167 0.68877
C  2.437096 -1.158826 2.097385
C  2.338064 -2.036707 -2.166708
C  -2.153515 1.014222 0.468099
C  -1.294898 -0.092858 0.284906
C  -3.559961 0.812278 0.457524
C  -1.817022 -1.400875 0.082457
C  -4.081293 -0.488631 0.269682
C  -3.227839 -1.595615 0.081428
H  3.977236 1.342544 -0.484738
H  3.03111 1.266064 1.027589
H  4.299584 -1.00127 0.956191
H  3.187396 -2.27641 0.403126
H  4.179698 -0.941538 -1.712693
H  2.846518 0.053013 -2.352357
H  2.366147 3.065889 -0.730943
H  1.575638 1.714525 -1.624989
H  -0.575178 2.459476 -1.256112
H  -0.205931 3.872996 -0.193354
H  -2.380146 3.1636 0.526776
H  -1.248643 2.52954 1.740163
H  2.432137 -0.138288 2.518857
H  1.384796 -1.457019 1.946855
H  2.891263 -1.832347 2.848227
H  2.538435 -2.919765 -1.532301
H  1.24777 -1.861469 -2.186869
H  2.669979 -2.286422 -3.191632
H  -0.209759 0.06124 0.300221
H  -4.238018 1.663186 0.594018
H  -5.167202 -0.642745 0.263682
H  -3.645989 -2.599272 -0.067474
H  -1.273576 -3.414842 -0.250182
H  0.068267 -2.293517 -0.142991
