program: Gaussian 09
title: 000033205
version: EM64L-G09RevD.01
frameworkgroup: C1[X(C15H26N2O)]
method: RPBEPBE
basis: SDD
operation: Freq
keyword: #p
keyword: freq=noraman
keyword: PBEPBE/SDD
title: #p freq=noraman PBEPBE/SDD
converged: YES YES NO NO
title: Mulliken charges:
elementType: O N N C C C C C C C C C C C C C C C H H H H H H H H H H H H H H H H H H H H H H H H H H
charge: -0.286930 -0.105393 -0.699688 0.090668 -0.376246 -0.226029 -0.586978 -0.318443 -0.319884 0.502826 -0.738019 -0.672458 -0.686225 -0.458769 -0.386765 -0.415306 -0.426492 0.471639 0.185706 0.181021 0.219933 0.177796 0.183546 0.191341 0.228857 0.199673 0.182110 0.200325 0.183081 0.217799 0.226674 0.213729 0.217204 0.238673 0.199607 0.205102 0.243279 0.206284 0.220308 0.302267 0.209063 0.208593 0.297732 0.298786
chargesum: 0.00000
title: Mulliken charges with hydrogens summed into heavy atoms:
elementType: O N N C C C C C C C C C C C C C C C
charge: -0.286930 -0.105393 -0.103170 0.276374 0.024708 0.135313 -0.166780 0.063340 0.063522 0.502826 -0.079817 -0.016973 -0.031560 -0.238461 -0.084498 -0.206243 -0.217898 0.471639
polarizability: 2.08350024e+02 1.11418185e+01 2.10703591e+02 2.25516776e+00 5.60997709e+00 1.32249564e+02
1716.lowfreq: -6.6789 0.0001 0.0007 0.0007 5.2349 6.3186 19.4435 28.4983 38.1896
frequency: 18.9441 28.4795 38.1724 52.2228 67.9670 70.2361 78.2632 98.9200 131.1178 156.2802 181.4384 184.9469 202.8604 223.6695 236.1472 252.6771 285.2775 292.1847 293.8728 306.1185 335.8370 346.7465 354.6062 378.2624 415.0412 425.4365 439.3748 463.9416 465.6892 510.8219 527.0111 560.8328 638.9993 708.8035 717.1621 759.9499 767.5714 792.7561 798.6555 812.1076 829.0533 838.1138 881.4219 891.9924 914.3758 917.7342 937.1273 938.8181 1000.4499 1005.0632 1011.6484 1015.6462 1034.5061 1044.6448 1062.8581 1075.4825 1087.1620 1088.6168 1096.1660 1117.0442 1127.7603 1128.9445 1168.4855 1190.3245 1202.3166 1211.7559 1221.0903 1227.3629 1277.2697 1281.9463 1290.2352 1291.5077 1306.7865 1316.1637 1321.4273 1348.0593 1357.5509 1364.1395 1375.0929 1379.7461 1382.9485 1386.2821 1389.2022 1392.2491 1430.1652 1447.6225 1450.5348 1463.4611 1464.1739 1467.1863 1471.6896 1473.3905 1476.6139 1478.8903 1486.6850 1491.8100 1517.5701 1579.5287 1629.7456 1641.2002 2837.7315 2846.2434 2864.0711 2918.9789 2940.8721 2966.5536 2971.6940 2978.6683 2981.9379 2985.7011 3018.4060 3030.8279 3034.4974 3056.6078 3072.7668 3072.9028 3078.9327 3082.6199 3090.8313 3094.6697 3101.0552 3105.4631 3125.7680 3130.9050 3569.5143 3710.7950
redmass: 3.3509 3.3423 4.3392 3.1677 2.8999 3.3897 2.2446 2.2053 3.2217 3.7216 2.2073 1.3931 1.3333 1.3025 2.2192 3.6945 1.8780 2.0516 1.2303 2.4881 3.5750 2.3414 1.0411 2.7503 2.8241 3.1139 2.4054 2.5693 2.5700 3.0898 2.9869 3.0746 6.3535 2.8430 3.0481 2.7656 3.4718 1.1561 1.1444 1.5367 3.8397 1.5774 1.9705 1.9243 1.9575 1.9163 1.4115 2.0829 2.4234 1.3778 1.6451 1.8784 2.2326 2.4901 2.3448 1.9577 2.1149 2.6303 2.2487 1.8864 1.5354 1.4813 1.5278 1.1044 2.1230 1.9067 1.5073 1.3409 1.1184 1.3996 1.2294 1.3062 2.7166 1.2766 1.2806 1.6816 1.3320 1.3507 1.3290 1.4045 2.3689 1.5994 1.2333 1.2254 2.6960 1.1439 1.0750 1.0536 1.0741 1.0631 1.0588 1.0550 1.0555 1.0622 1.0686 1.0707 2.9947 6.5422 1.8217 2.1228 1.0722 1.0718 1.0702 1.0566 1.0830 1.1039 1.0614 1.0376 1.0357 1.0362 1.0865 1.0981 1.0866 1.0872 1.0987 1.0984 1.0982 1.1002 1.1002 1.1002 1.0864 1.0883 1.0956 1.0970 1.0446 1.1040
irintensity: 0.2843 0.0661 0.0828 0.1571 0.6818 2.2556 0.1567 0.2858 4.0731 0.8641 4.2999 3.7537 2.0348 1.1452 2.3830 3.0422 2.3933 14.1731 282.9804 0.1442 12.6411 0.6374 0.0322 2.7254 0.0245 9.7704 1.7990 3.9462 2.3566 9.1004 8.8921 13.0021 0.5821 15.6524 1.3971 6.9348 5.9804 6.3707 4.8957 34.8976 2.5041 32.9713 8.0556 5.2005 6.4863 2.3995 0.4767 22.4022 0.6976 0.8975 7.5981 2.4462 31.5130 74.9349 30.7904 17.2673 2.5736 22.5501 17.9800 22.8686 46.1988 6.4832 5.5567 15.2311 26.4713 0.5767 2.7723 12.6595 3.1360 4.7155 16.5001 17.8590 48.0451 30.3960 13.9248 5.5204 2.6812 1.0628 3.7651 26.9971 8.1647 5.6069 14.7992 17.1176 1.1300 10.4556 2.3263 4.2555 0.9252 9.4666 7.6548 4.1749 12.1214 8.2833 12.2545 14.8291 143.7499 5.9861 2.8266 258.8138 43.7770 123.3921 206.3256 101.8674 34.2596 67.9440 29.8606 56.6515 24.2435 30.2408 18.6665 23.3341 16.9227 20.5240 44.4044 49.0599 55.7687 34.2259 46.9122 39.1981 18.3594 34.0583 17.5084 25.3416 55.3582 16.8722
temp: 298.150 k
press: 1.00000 atm
elementType: 8 7 7 6 6 6 6 6 6 6 6 6 6 6 6 6 6 6 1 1 1 1 1 1 1 1 1 1 1 1 1 1 1 1 1 1 1 1 1 1 1 1 1 1
symmnumber: 1
zpe: 1009560.0 jmol-1
zpe.correction: 0.384521 hartree
zpe.thermalcorrener: 0.405542 hartree
zpe.thermalcorrenthalpy: 0.406486 hartree
zpe.thermalcorrgfe: 0.333382 hartree
zpe.sumelectzpe: -770.468271 hartree
zpe.sumelectthermal: -770.447250 hartree
zpe.sumelectthermalent: -770.446306 hartree
zpe.sumelectthermalfe: -770.519410 hartree
dipole: 0.4804 -1.2653 -1.5692
dipole: 2.0723
quadrupole: -96.0359 -97.3347 -114.4217
quadrupole: 5.2643 -0.0802 -0.9461
quadrupole: 6.5615 5.2627 -11.8243 5.2643 -0.0802 -0.9461
hfenergy: -770.8527918 hartree
pointgroup: C01 [X(C15H26N2O1)]
dipole: -0.1292404 -0.4935208 0.6359449 debye
polarizability: 207.3417339|-11.6430037|211.2226484|-6.4463457|-4.3392812|132.7387976 unknown
InChI: InChI=1S/C15H26N2O/c1-4-17(5-2)10-11-18-13(3)12-14-6-8-15(16)9-7-14/h6-9,13H,4-5,10-12,16H2,1-3H3
charge 0 multiplicity 1
44 atoms
O  -1.334877 1.812444 -0.044301
N  -2.718584 -0.900078 0.342126
N  3.801782 -2.718122 -0.199751
C  -0.146915 2.57613 0.410789
C  -3.287092 0.46751 0.445015
C  -2.301442 1.499924 1.010126
C  0.952069 2.317152 -0.644922
C  -3.268275 -1.66911 -0.808034
C  -2.800118 -1.636946 1.63201
C  1.686197 0.987336 -0.510197
C  -0.485815 4.073255 0.550309
C  -2.691781 -1.214919 -2.162703
C  -1.763367 -2.769873 1.754532
C  3.10299 0.941059 -0.551878
C  0.992061 -0.244539 -0.357643
C  3.812799 -0.273962 -0.450595
C  1.688564 -1.464598 -0.25132
C  3.112109 -1.503303 -0.299594
H  0.178672 2.1693 1.394539
H  -4.216078 0.479275 1.069919
H  -3.576186 0.814659 -0.562658
H  -2.859072 2.414141 1.315391
H  -1.775764 1.100034 1.9055
H  1.686591 3.144116 -0.595567
H  0.454309 2.393538 -1.633623
H  -3.011904 -2.733229 -0.655457
H  -4.387556 -1.616152 -0.834258
H  -2.614346 -0.909007 2.444544
H  -3.830589 -2.043874 1.805583
H  -1.33445 4.233575 1.239955
H  -0.755755 4.497993 -0.433566
H  0.381433 4.633332 0.947172
H  -2.901117 -0.149374 -2.363832
H  -1.595867 -1.343004 -2.173485
H  -3.130302 -1.809468 -2.986378
H  -1.912569 -3.554074 0.990018
H  -0.744546 -2.362141 1.63513
H  -1.838846 -3.25361 2.746548
H  3.668213 1.875476 -0.667106
H  -0.104249 -0.243367 -0.315642
H  4.909853 -0.273748 -0.486823
H  1.126478 -2.401299 -0.137282
H  4.81566 -2.746039 -0.242123
H  3.29828 -3.593517 -0.096471
