program: Gaussian 09
title: 000033166
version: EM64L-G09RevD.01
frameworkgroup: C1[X(C8H12N2O)]
method: RPBEPBE
basis: SDD
operation: Freq
keyword: #p
keyword: freq=noraman
keyword: PBEPBE/SDD
title: #p freq=noraman PBEPBE/SDD
converged: NO YES NO NO
title: Mulliken charges:
elementType: O N N C C C C C C C C H H H H H H H H H H H H
charge: -0.264853 -0.018761 -0.037357 -0.168641 0.158142 -0.701689 -0.701681 0.034813 -0.313040 -0.258592 -0.504162 0.250370 0.237914 0.214994 0.216851 0.216861 0.215005 0.237898 0.239863 0.238391 0.239041 0.239034 0.229600
chargesum: 0.00000
title: Mulliken charges with hydrogens summed into heavy atoms:
elementType: O N N C C C C C C C C
charge: -0.264853 -0.018761 -0.037357 0.081729 0.158142 -0.031930 -0.031917 0.034813 -0.073177 -0.020200 0.203513
polarizability: 1.19008010e+02 2.43530383e+00 1.22634246e+02 3.04632759e-04 3.30442546e-03 6.68858681e+01
1716.lowfreq: -15.5886 -14.1114 -11.2622 -2.6655 0.0008 0.0009 0.0011 88.6004 117.2635
frequency: -6.4396 88.5287 117.2569 155.2167 157.3166 198.0603 213.2476 224.3990 249.7073 291.1272 356.5277 405.9249 482.7074 516.1714 578.0457 579.6077 599.9155 704.0204 802.1575 834.5124 851.8094 888.2773 923.1835 937.8905 952.6896 956.3897 1039.4659 1066.6343 1092.8334 1106.6976 1112.1072 1143.5307 1171.0296 1242.9068 1261.6674 1273.3123 1315.7794 1338.2029 1367.4702 1377.8873 1390.1379 1418.4364 1439.6170 1448.6803 1461.2332 1464.9273 1470.9466 1475.6548 1488.4930 1509.0228 1519.5964 2979.0288 2980.8923 3000.0651 3037.8033 3073.8479 3077.9902 3086.9690 3095.1445 3100.0803 3138.0034 3143.5420 3166.0892
redmass: 2.8774 3.8404 3.2628 3.0761 1.1572 1.2804 1.9122 1.5939 1.6367 2.8171 4.5544 2.9257 5.1657 8.8131 3.4081 7.1659 3.4410 4.2509 8.1911 5.2691 1.2432 2.9327 1.1627 1.4426 8.8893 1.4734 2.1927 3.2257 1.8235 2.7008 1.2655 1.4138 2.0278 2.8216 2.4825 3.6111 1.2901 1.9221 1.1902 1.5426 1.4481 1.9354 1.3581 1.0511 1.0446 1.0589 1.0499 1.0474 1.1430 6.1172 4.9234 1.0343 1.0348 1.0293 1.0852 1.1005 1.0996 1.1009 1.0994 1.1042 1.0877 1.1047 1.0992
irintensity: 0.3467 0.3296 7.0767 3.9823 0.5137 0.3525 0.6789 0.4874 0.4171 3.1273 6.1066 1.6473 4.2046 8.1780 0.3279 4.1344 4.4816 4.6832 0.3768 0.9606 38.7026 1.1884 5.4416 0.0856 32.7270 0.0702 9.5061 44.8773 45.6019 0.6263 0.2066 10.7332 5.5903 37.8096 51.6605 8.8852 0.0532 110.9799 15.9764 75.9791 38.4414 10.9845 39.2492 12.5933 5.8302 19.0431 2.1601 15.0535 26.4943 41.5289 9.5235 39.3882 31.5191 47.2602 1.4205 20.8783 59.4781 3.7490 44.2760 28.4838 2.1629 21.2758 44.3814
temp: 298.150 k
press: 1.00000 atm
elementType: 8 7 7 6 6 6 6 6 6 6 6 1 1 1 1 1 1 1 1 1 1 1 1
symmnumber: 1
zpe: 496093.9 jmol-1
zpe.correction: 0.188952 hartree
zpe.thermalcorrener: 0.199543 hartree
zpe.thermalcorrenthalpy: 0.200487 hartree
zpe.thermalcorrgfe: 0.153146 hartree
zpe.sumelectzpe: -495.915934 hartree
zpe.sumelectthermal: -495.905343 hartree
zpe.sumelectthermalent: -495.904399 hartree
zpe.sumelectthermalfe: -495.951740 hartree
dipole: 1.3693 -0.6358 0.0002
dipole: 1.5097
quadrupole: -63.7457 -60.0859 -67.0337
quadrupole: 0.4556 0.0000 0.0005
quadrupole: -0.1240 3.5359 -3.4119 0.4556 0.0000 0.0005
hfenergy: -496.1048859 hartree
pointgroup: C01 [X(C8H12N2O1)]
dipole: 0.5242685 -0.2791724 0.0000347 debye
dipolederiv: -0.5645917 0.3938887 0.0001277 0.5633006 -1.4143316 -0.0004054 0.0001645 -0.0003243 -0.2997298 -0.2596936 0.0991333 0.000041 -0.1173435 -0.0789612 0.0001061 -0.0000584 0.0001001 -0.2516882 -0.2312563 -0.2652814 -0.000104 0.2960646 -0.5114237 -0.0000614 0.0001288 -0.0001215 -0.227372 -0.1109282 -0.1108893 -0.0000294 0.0674501 0.1130958 0.0000796 0.0002191 0.0001422 0.0413631 0.5249384 0.6246483 0.000291 0.2345264 -0.1567251 -0.0000777 0.0000555 -0.0000004 0.0049248 0.0066982 0.006356 -0.0465597 -0.0742912 0.0281325 -0.0003866 0.0388081 0.0612459 -0.0087875 0.0066857 0.006248 0.0465423 -0.074273 0.028236 0.0004423 -0.0390261 -0.0612362 -0.0088841 -0.1169913 -0.3954237 -0.0002345 -0.4739 1.4388262 0.0004187 -0.0002237 0.0003594 0.2218406 -0.174359 -0.3546672 -0.0001746 0.1302107 0.1874538 0.0001467 0.0000771 0.0000538 -0.0695709 0.2800636 0.3355632 0.0001897 -0.1979998 0.1200274 0.0000467 -0.0000785 0.00009 -0.0493451 0.5575669 -0.3486648 -0.0001211 -0.2116924 0.4784992 0.0000614 -0.0000513 -0.0000008 0.2675078 0.0581767 0.0701075 0.0000545 0.0368838 -0.0708854 -0.0001018 0.0000178 -0.0000968 0.0357371 0.0933084 0.0390765 -0.0170226 0.0923339 -0.0903023 0.0355753 0.0123238 -0.0220691 0.0812227 -0.1457906 -0.1376395 -0.0384796 -0.1372967 0.011069 0.0000818 -0.0252733 0.006863 0.0743621 0.0340229 0.0475073 0.1251816 0.030898 0.0798669 -0.0424229 0.0771176 -0.0316265 -0.1248036 0.0339817 0.0477022 -0.1251475 0.0310117 0.0797573 0.0427236 -0.0771264 0.0318848 -0.1246262 -0.1457901 -0.1377057 0.0383263 -0.1373141 0.0110872 -0.0001528 0.0251691 -0.0069068 0.0743398 0.0932685 0.0390404 0.0171128 0.0923181 -0.0903186 -0.0358476 -0.0121823 0.0218149 0.0811867 0.0860142 0.0311404 0.000004 -0.024961 -0.1236059 -0.0001336 -0.0000325 -0.0001105 0.1522328 -0.0316939 -0.1368742 -0.000082 -0.0799545 -0.0078975 -0.0000726 -0.0000407 -0.0000714 0.134399 -0.0352569 0.0906261 -0.0651022 -0.0399324 0.0622568 -0.0743513 -0.0956749 -0.0254843 -0.0616921 -0.0353105 0.0906073 0.0651922 -0.0399855 0.0621912 0.0743979 0.0956741 0.0255664 -0.0616327 0.0769369 -0.0344997 -0.0000058 0.0339462 -0.156048 -0.0000667 0.0000124 -0.000072 0.1190156 unknown
polarizability: 119.2844285|2.6185192|122.3578169|0.008433|0.0228095|66.8858784 unknown
InChI: InChI=1S/C8H12N2O/c1-6(2)7-8(11-3)10-5-4-9-7/h4-6H,1-3H3
charge 0 multiplicity 1
23 atoms
O  0.968057 -1.760613 -0.00084
N  -0.68879 1.497536 0.000315
N  1.924911 0.402563 0.000176
C  -1.755015 -0.737048 -0.000858
C  -0.516904 0.147495 -0.00032
C  -2.597002 -0.477332 -1.278654
C  -2.596661 -0.479232 1.27757
C  0.820647 -0.382179 -0.000349
C  0.422002 2.299498 0.000887
C  1.721107 1.755431 0.000803
C  2.353021 -2.280478 -0.0008
H  -1.41638 -1.787994 -0.001666
H  -2.90347 0.582678 -1.319736
H  -3.50412 -1.108876 -1.273716
H  -2.022798 -0.708333 -2.194483
H  -2.022208 -0.711581 2.1929
H  -3.503783 -1.110764 1.271951
H  -2.903132 0.580714 1.320289
H  0.252204 3.380198 0.001363
H  2.61333 2.389802 0.001171
H  2.896077 -1.937255 0.896108
H  2.896257 -1.936856 -0.897449
H  2.232049 -3.373176 -0.001062
