program: Gaussian 09
title: 000033163
version: EM64L-G09RevD.01
frameworkgroup: C1[X(C5H12O2S)]
method: RPBEPBE
basis: SDD
operation: Freq
keyword: #p
keyword: freq=noraman
keyword: PBEPBE/SDD
title: #p freq=noraman PBEPBE/SDD
converged: YES YES NO NO
title: Mulliken charges:
elementType: S O O C C C C C H H H H H H H H H H H H
charge: 0.205414 -0.267499 -0.450547 -0.655205 -0.219600 -0.620228 -0.285416 -0.495540 0.236781 0.264332 0.193242 0.203678 0.234281 0.267048 0.195945 0.207606 0.205342 0.235418 0.197224 0.347725
chargesum: 0.00000
title: Mulliken charges with hydrogens summed into heavy atoms:
elementType: S O O C C C C C
charge: 0.205414 -0.267499 -0.102822 -0.154091 0.177320 -0.118899 0.118135 0.142443
polarizability: 1.09504076e+02 -7.87366098e-01 7.48873111e+01 -1.78560864e+00 5.31542482e-01 5.89925223e+01
1716.lowfreq: -11.5176 0.0020 0.0022 0.0032 3.8466 12.7578 33.1009 40.3853 57.4701
frequency: 31.9816 40.2994 57.4280 95.1101 116.0278 162.4676 212.0021 226.8315 251.2994 271.1250 314.2507 441.5386 485.6843 633.1358 641.0993 785.2232 834.3769 931.9663 951.3841 991.3568 1002.1007 1028.3398 1038.5825 1095.9653 1115.2640 1139.9708 1143.9892 1183.1886 1200.7163 1230.0147 1256.9088 1279.7711 1308.7181 1374.6084 1403.2640 1428.1063 1432.3061 1436.7050 1458.1880 1463.3122 1469.1567 1480.0898 2905.1424 2924.1774 2930.7118 2966.6956 2993.1927 2996.2283 3014.4020 3015.0652 3084.3713 3089.9998 3104.2243 3578.7873
redmass: 5.9462 3.1684 3.3398 3.3136 3.3099 3.7933 1.4337 1.2225 1.9608 2.0492 2.6800 2.7332 2.9050 5.1457 3.4007 2.3663 2.1331 2.1124 2.3076 1.6737 1.6199 2.5486 2.5422 3.2420 1.2970 1.3063 1.1417 1.2015 1.1170 1.2857 1.2611 1.1807 1.2601 1.3174 1.4087 1.1017 1.1043 1.1464 1.0514 1.0671 1.0788 1.0706 1.0569 1.0364 1.0586 1.1002 1.0983 1.1024 1.0598 1.0597 1.1068 1.1076 1.0969 1.0666
irintensity: 6.5689 1.4821 5.2033 2.9192 5.0862 12.0949 8.5116 132.3040 1.6732 29.3833 0.2240 16.5284 2.3551 5.1664 0.1355 3.9256 12.8000 13.9073 12.1536 8.3582 17.0689 46.4585 67.2370 73.8892 5.7806 10.6909 3.3091 3.8648 7.1693 4.6466 34.9894 30.4082 3.7188 13.2365 1.1310 13.5972 10.1846 0.0992 12.4203 16.4157 7.4659 5.6423 57.6460 122.3247 76.3488 47.8973 30.5488 72.0610 13.0260 74.4665 48.7143 0.4291 29.8329 4.6835
temp: 298.150 k
press: 1.00000 atm
elementType: 16 8 8 6 6 6 6 6 1 1 1 1 1 1 1 1 1 1 1 1
symmnumber: 1
zpe: 436917.2 jmol-1
zpe.correction: 0.166413 hartree
zpe.thermalcorrener: 0.177676 hartree
zpe.thermalcorrenthalpy: 0.178620 hartree
zpe.thermalcorrgfe: 0.127513 hartree
zpe.sumelectzpe: -745.505230 hartree
zpe.sumelectthermal: -745.493967 hartree
zpe.sumelectthermalent: -745.493023 hartree
zpe.sumelectthermalfe: -745.544131 hartree
dipole: 0.1629 1.9659 -0.2706
dipole: 1.9911
quadrupole: -39.9625 -52.9228 -59.5965
quadrupole: -0.4519 -9.7533 1.5931
quadrupole: 10.8647 -2.0955 -8.7693 -0.4519 -9.7533 1.5931
hfenergy: -745.6716432 hartree
pointgroup: C01 [X(C5H12O2S1)]
dipole: -0.0662906 0.7630011 0.1646354 debye
dipolederiv: -0.2173722 -0.0345575 0.0254416 -0.0373863 0.0164173 0.0167983 0.0990541 0.0235334 -0.1752015 -0.892622 0.2776778 -0.0276274 0.3600783 -0.6405643 -0.0007548 -0.0958857 0.0659334 -0.4216093 -0.5258297 0.0092061 -0.2351532 -0.0101748 -0.6205062 -0.1935506 -0.2878265 -0.2444889 -0.43972 0.2025702 0.2066491 0.0340665 0.289939 0.0790811 0.0028022 0.0627443 -0.0138812 0.135096 0.4115914 -0.0666619 0.1316662 -0.2876151 0.5451774 -0.0562394 0.1841307 -0.1502693 0.374661 0.3088056 -0.1642351 0.0164596 -0.2303384 -0.0161193 -0.0075765 0.0445291 0.0320643 0.1271622 0.3299954 0.0368563 0.1477895 0.1760423 0.556591 0.1730767 0.0976629 0.168963 0.3917761 0.6879333 -0.1474374 -0.0241384 -0.1342785 0.3858155 0.0786729 -0.1491471 0.1334833 0.2938108 -0.0275047 0.03527 -0.0376847 -0.0114585 -0.0970953 0.0820443 -0.0340255 0.0982166 0.0252669 -0.0114019 -0.0576138 -0.0150588 -0.113174 0.0050167 -0.0706483 -0.0148964 -0.0997486 -0.0922118 -0.1772015 -0.1646863 0.0236826 -0.0444137 -0.1566158 0.0477102 -0.0336542 0.0360686 0.0505337 0.0665944 0.0197272 -0.0279518 0.0617829 -0.0134946 -0.1002748 -0.0504533 0.004505 -0.187374 -0.0149098 -0.0050005 -0.0188148 0.0368322 -0.0669765 -0.1040818 -0.0045064 -0.1181522 0.0001195 -0.0527802 0.0482104 -0.0222136 0.1045663 0.017803 0.0807737 -0.0311699 0.1033019 -0.0683619 -0.2201972 0.1244297 0.051403 0.0708993 -0.0929523 -0.0810516 0.0100128 -0.0620264 0.0340715 0.0923455 0.0153451 -0.079719 -0.0336762 -0.027875 0.0742029 -0.0385113 0.0210361 -0.1839608 -0.0106328 0.0085093 -0.0585014 0.0232074 0.012027 -0.0924849 0.0599516 -0.1712992 -0.1646149 0.0309578 0.0670481 -0.0260761 0.106445 -0.028363 0.1017176 -0.0602475 0.1196874 0.0044197 -0.1953523 -0.0542105 0.0241534 -0.1854114 -0.0830132 0.0065417 0.0857577 -0.0234111 0.0695032 0.2150106 -0.1545263 0.1182767 -0.1418656 0.2256463 0.0423224 0.1564803 0.0764842 0.2266336 unknown
polarizability: 109.4688278|1.0750163|74.8861454|-2.0768469|0.647773|59.0289362 unknown
InChI: InChI=1S/C5H12O2S/c1-7-3-5-8-4-2-6/h6H,2-5H2,1H3
charge 0 multiplicity 1
20 atoms
S  -0.503151 -0.302832 0.01272
O  2.631756 -0.368393 0.457989
O  -3.530443 -1.069046 -0.517477
C  0.752646 1.115682 0.133873
C  2.104811 0.679404 -0.418831
C  -2.072242 0.765459 0.050194
C  -3.268678 -0.055998 0.516174
C  3.868636 -0.950874 -0.055214
H  0.368086 1.957949 -0.468935
H  0.849227 1.427758 1.187775
H  2.803251 1.548785 -0.435535
H  1.992212 0.298547 -1.458272
H  -1.900924 1.594155 0.760622
H  -2.257367 1.175106 -0.957583
H  -4.147607 0.616387 0.633763
H  -3.041866 -0.524103 1.497098
H  3.714577 -1.421853 -1.049656
H  4.170104 -1.722296 0.670512
H  4.676071 -0.191137 -0.141033
H  -4.168701 -1.742101 -0.172484
