program: Gaussian 09
title: 000033157
version: EM64L-G09RevD.01
frameworkgroup: C1[X(C3H5Cl3)]
method: RPBEPBE
basis: SDD
operation: Freq
keyword: #pfreq=noraman
keyword: PBEPBE/SDD
title: #p freq=noraman PBEPBE/SDD
converged: NO YES NO NO
title: Mulliken charges:
elementType: Cl Cl Cl C C C H H H H H
charge: 0.004229 0.016406 -0.064924 -0.300854 -0.514942 -0.557217 0.260538 0.258148 0.340213 0.277211 0.281191
chargesum: 0.00000
title: Mulliken charges with hydrogens summed into heavy atoms:
elementType: Cl Cl Cl C C C
charge: 0.004229 0.016406 -0.064924 0.217831 -0.174728 0.001186
polarizability: 6.57610536e+01 -3.78263329e+00 6.02938336e+01 3.62888341e+00 1.87789093e+00 4.69526194e+01
1716.lowfreq: -11.8032 -0.0032 -0.0023 -0.0012 4.6174 13.6073 53.5175 99.5966 194.4485
frequency: 53.4946 99.5873 194.4349 238.8409 281.3668 376.9280 417.9239 586.3455 613.5466 697.9103 852.0390 952.8494 1007.6341 1107.6862 1137.2984 1183.3107 1211.1087 1268.6413 1310.5795 1356.9472 1432.6613 1446.4393 3008.2885 3064.6393 3074.7829 3144.7021 3153.8791
redmass: 10.0597 8.9959 3.5242 7.4226 5.8709 2.7964 4.3956 3.8570 5.9881 4.3277 1.7808 2.0297 1.9239 3.1301 1.0598 1.2230 1.1146 1.1984 1.1366 1.4691 1.0874 1.0917 1.0604 1.0745 1.0827 1.0894 1.1113
irintensity: 2.8112 3.5795 1.9133 4.1161 1.8927 6.1140 20.9102 36.8912 14.0666 100.0816 41.6313 21.7871 8.5265 9.0630 3.9461 3.5698 17.5633 25.1516 10.4957 9.7410 17.5501 13.9739 3.4381 5.6781 14.4057 1.7763 5.3414
temp: 298.150 k
press: 1.00000 atm
elementType: 17 17 17 6 6 6 1 1 1 1 1
symmnumber: 1
zpe: 199021.9 jmol-1
zpe.correction: 0.075803 hartree
zpe.thermalcorrener: 0.083043 hartree
zpe.thermalcorrenthalpy: 0.083987 hartree
zpe.thermalcorrgfe: 0.042208 hartree
zpe.sumelectzpe: -1497.009603 hartree
zpe.sumelectthermal: -1497.002364 hartree
zpe.sumelectthermalent: -1497.001420 hartree
zpe.sumelectthermalfe: -1497.043199 hartree
dipole: -0.9641 -0.4448 2.0219
dipole: 2.2837
quadrupole: -64.7797 -58.0565 -53.4107
quadrupole: -0.9244 -3.1533 0.0755
quadrupole: -6.0308 0.6925 5.3383 -0.9244 -3.1533 0.0755
hfenergy: -1497.0854067 hartree
pointgroup: C01 [X(C3H5Cl3)]
dipole: 0.4287284 -0.3211124 -0.721349 debye
dipolederiv: -0.2214322 0.0891759 0.0110225 0.027432 -0.7099292 0.0513918 0.0334995 0.1186499 -0.1647809 -0.5584463 -0.285055 0.0891815 -0.223538 -0.3825335 0.0508697 0.05567 0.0100163 -0.1422918 -0.3751477 -0.0127706 -0.1321025 0.0077626 -0.1780395 0.020743 -0.2113664 -0.0047233 -0.4134118 -0.1850721 -0.0319612 0.0294074 -0.0286407 -0.1529102 -0.0052248 -0.1010166 -0.009819 -0.1030802 0.8142273 0.1859398 -0.0901229 0.1544754 1.2087848 -0.1438366 -0.1462844 -0.1225105 0.278561 0.38832 -0.0279998 0.2896387 0.0642771 0.1614902 -0.0244249 0.3696423 -0.019361 0.5385433 0.0559802 0.0425314 0.0144301 0.0155028 -0.0622851 0.0310686 0.0582856 0.0255635 0.1055253 0.0122794 -0.0064452 -0.1001039 -0.0200013 0.1299989 0.0101742 -0.0209223 0.0022708 -0.0318523 0.0239698 -0.0243236 -0.0520649 -0.0047691 -0.0444612 0.0228813 0.0160312 0.0082388 -0.0000227 -0.0488734 0.0380456 0.0203645 0.046516 0.0778898 -0.0564693 0.0237852 -0.0413129 -0.0734661 0.094195 0.0328629 -0.0796505 -0.0390169 -0.048005 0.0428269 -0.0773243 0.0329875 0.0062762 unknown
polarizability: 65.3305823|4.6303775|59.1060623|4.0475467|-3.8750418|48.570862 unknown
InChI: InChI=1S/C3H5Cl3/c4-2-1-3(5)6/h3H,1-2H2
charge 0 multiplicity 1
11 atoms
Cl -1.139217 1.749175 -0.143393
Cl -2.347302 -1.027877 0.337544
Cl 2.462976 -0.182446 0.928472
C  0.208185 -0.651248 -0.704265
C  -0.758894 -0.034939 0.302361
C  1.582158 0.022559 -0.735857
H  0.32381 -1.722134 -0.454872
H  -0.237326 -0.592024 -1.716107
H  -0.384026 -0.013145 1.332791
H  2.242779 -0.453249 -1.474338
H  1.518557 1.107028 -0.904237
