program: Gaussian 09
title: 000033152
version: EM64L-G09RevD.01
frameworkgroup: C1[X(C8H16O2)]
method: RPBEPBE
basis: SDD
operation: Freq
keyword: #pfreq=noraman
keyword: PBEPBE/SDD
title: #p freq=noraman PBEPBE/SDD
converged: NO YES NO NO
title: Mulliken charges:
elementType: O O C C C C C C C C H H H H H H H H H H H H H H H H
charge: -0.244274 -0.286524 -0.028846 -0.439000 -0.403268 -0.022070 -0.326340 -0.725998 -0.197910 -0.683739 0.231370 0.214877 0.199098 0.197211 0.202236 0.209524 0.213276 0.200430 0.205678 0.215214 0.212246 0.186724 0.216003 0.203907 0.224222 0.225951
chargesum: 0.00000
title: Mulliken charges with hydrogens summed into heavy atoms:
elementType: O O C C C C C C C C
charge: -0.244274 -0.286524 0.202524 -0.025024 -0.003821 0.187454 0.087366 -0.092859 0.204817 -0.029659
polarizability: 1.06051089e+02 9.32153982e-02 8.63284316e+01 -4.24979499e-01 -2.62443866e+00 8.24130599e+01
1716.lowfreq: -35.3115 -8.4167 -0.0007 -0.0005 0.0007 8.2487 49.5076 76.5367 87.2284
frequency: 49.4227 76.3028 87.0394 149.3209 206.3412 216.8868 239.4378 261.7109 289.3360 317.7602 364.3327 403.3092 430.2381 514.0789 560.1088 686.1602 759.5937 787.2810 798.7120 810.0689 865.3978 889.0690 940.8684 954.4955 968.9772 983.3869 1027.6998 1046.3564 1083.3867 1094.2521 1108.1377 1133.8459 1141.0108 1164.8393 1174.2951 1237.5639 1246.5789 1259.0667 1284.4695 1302.9437 1306.7420 1328.3921 1350.0916 1354.9436 1364.8048 1372.8168 1388.6687 1395.1180 1440.7237 1451.8047 1460.3804 1461.9702 1475.7593 1476.8496 1480.3667 1495.0344 2941.2649 2964.9703 2972.2987 2974.3486 2979.9614 2986.4368 2991.8309 2999.6092 3012.6850 3035.8388 3055.9515 3064.0189 3066.1895 3079.5596 3089.2104 3098.6332
redmass: 2.3091 2.7768 2.4735 3.1963 2.0825 1.2072 1.4114 1.6654 2.4045 3.1682 3.4150 3.2609 1.9326 2.7850 4.5771 3.4265 3.8996 2.1324 2.2737 1.1064 2.4335 2.0697 2.6166 1.4750 1.7376 1.7553 2.4598 2.9739 3.6874 2.3750 1.9786 1.8227 1.6728 1.8745 1.4141 1.2743 1.1538 1.2890 1.4272 1.2256 1.3237 1.2223 1.4018 1.5066 1.3442 1.3193 1.2187 1.2940 1.0895 1.0932 1.0479 1.0804 1.0449 1.0579 1.0465 1.0820 1.0620 1.0367 1.0594 1.0667 1.0746 1.0833 1.0360 1.0720 1.0999 1.1007 1.1003 1.0996 1.0993 1.0996 1.0989 1.1011
irintensity: 0.0467 1.0673 2.0611 8.0042 0.9464 0.6788 0.8193 7.4520 0.0474 3.8240 7.5978 0.5645 0.6403 2.2330 6.0813 3.3237 15.4824 20.5970 14.1507 4.4636 22.0373 10.0545 129.7998 1.1891 8.1364 15.0386 43.2450 82.7709 72.3360 7.1378 14.2096 14.4194 6.8123 14.4151 24.8059 2.2775 1.6876 12.7479 22.2155 23.0507 3.1158 4.1994 1.7670 10.1012 0.8937 1.9800 9.8298 21.3332 4.2447 11.6171 4.9879 11.5708 15.1694 7.4670 5.8854 4.8111 60.0624 31.5810 43.6958 42.4638 13.7674 26.4901 28.5722 65.4435 28.5282 43.4927 7.9272 72.5334 48.5951 44.1993 38.9529 41.4372
temp: 298.150 k
press: 1.00000 atm
elementType: 8 8 6 6 6 6 6 6 6 6 1 1 1 1 1 1 1 1 1 1 1 1 1 1 1 1
symmnumber: 1
zpe: 603105.4 jmol-1
zpe.correction: 0.229711 hartree
zpe.thermalcorrener: 0.240920 hartree
zpe.thermalcorrenthalpy: 0.241865 hartree
zpe.thermalcorrgfe: 0.192768 hartree
zpe.sumelectzpe: -464.049424 hartree
zpe.sumelectthermal: -464.038215 hartree
zpe.sumelectthermalent: -464.037271 hartree
zpe.sumelectthermalfe: -464.086367 hartree
dipole: 0.0598 -0.2713 -0.4726
dipole: 0.5482
quadrupole: -57.3131 -65.2266 -60.9745
quadrupole: 0.2650 -0.7259 -3.6074
quadrupole: 3.8583 -4.0552 0.1969 0.2650 -0.7259 -3.6074
hfenergy: -464.2791352 hartree
pointgroup: C01 [X(C8H16O2)]
dipole: 0.0253934 -0.0959076 -0.1915017 debye
dipolederiv: -0.7365733 -0.091102 0.077001 -0.3207431 -0.7661186 0.1424187 0.1126709 0.1946838 -0.5718187 -1.3095827 -0.1608628 -0.1928412 -0.1172595 -0.5415275 0.0322618 -0.3675266 -0.1034248 -0.4827809 0.0758077 0.0140502 0.0025844 0.0073285 0.0936284 0.0322272 -0.0461279 0.0279154 0.1006134 -0.1379238 0.0838856 0.0757756 0.0631101 -0.0254438 0.0328805 0.052894 -0.0117753 0.0586191 -0.0505363 0.1014813 0.0568589 0.1029493 -0.0391019 0.0066503 0.0618569 0.052427 0.1058341 1.055636 0.1684758 0.0999891 0.5108419 0.9295448 -0.1116625 0.3832604 0.0013779 0.5925231 0.5045646 0.0798605 -0.099822 0.0647388 0.2839071 -0.0443257 -0.1525089 -0.1666933 0.4809626 -0.0164296 0.0569228 0.018662 0.0701075 0.0275732 0.0094734 0.0492976 -0.0000138 0.0919251 0.8783005 0.0322951 0.0298859 -0.1395663 0.2924265 -0.0804759 -0.0234021 -0.0587695 0.3461666 -0.0593349 -0.048231 -0.0758876 -0.0392944 0.0410219 -0.0463828 -0.0834199 -0.0442432 -0.0216119 -0.0056857 -0.0414363 -0.0983706 -0.0268754 0.0166634 -0.0304695 -0.0941388 -0.0401511 -0.0683589 0.0818573 -0.0310869 0.0183303 -0.0461925 -0.158077 0.0721822 0.0268043 0.0244775 0.0637373 -0.0643343 -0.0242637 -0.1188192 -0.0381782 0.0684368 -0.0746484 -0.07154 -0.0305241 -0.0667018 -0.0041164 -0.0470404 0.1136731 -0.014969 0.0549513 0.0338213 0.1313436 0.0835691 -0.1294696 -0.0432623 -0.0456072 -0.0915354 -0.0196401 0.0205141 -0.0308526 -0.1482235 -0.0771232 -0.0425021 -0.0776741 -0.0131546 0.1290252 -0.0451357 -0.0014371 -0.0024682 0.0379891 0.0181103 -0.1773365 0.0389422 -0.0074322 0.0258619 -0.0007871 -0.1904069 0.0417613 0.028136 0.0013262 0.0582354 -0.0649814 -0.0097601 -0.0883676 -0.0364581 0.0649689 -0.083848 -0.0566147 0.0155776 -0.1348675 -0.0174969 -0.0112201 -0.0759713 -0.0693647 0.0494828 -0.0875793 -0.1444938 -0.0535641 -0.0616223 0.0646135 -0.0427602 0.004758 0.0254298 -0.1922423 0.0227771 -0.0094898 0.0479932 0.089869 -0.0209643 0.0122373 0.0981909 -0.0260948 0.0838481 0.0570337 0.1497758 0.0156121 -0.1161099 -0.0884762 -0.0061028 0.0222678 0.0125875 0.0549442 0.0411772 0.1321252 0.0142177 -0.2015657 -0.0134365 -0.027958 -0.0167249 0.0755458 -0.1625947 0.0279962 -0.0017933 0.0385609 0.0410007 -0.1798479 0.061478 -0.0206286 0.0872174 0.0682408 -0.0112116 -0.0079555 -0.0192594 0.0915444 0.0799928 -0.0161547 0.1101615 -0.0353673 0.0782587 0.0357494 0.0550291 0.0200981 -0.1195556 0.1109421 0.0134863 -0.0040571 -0.0439301 -0.1514611 0.0155142 -0.013948 0.0495951 0.0732705 unknown
polarizability: 106.0465197|0.3851427|86.6147933|-0.3161189|-2.3947427|82.1312676 unknown
InChI: InChI=1S/C8H16O2/c1-3-9-8-6-7(2)4-5-10-8/h7-8H,3-6H2,1-2H3
charge 0 multiplicity 1
26 atoms
O  -0.174693 1.447684 0.775492
O  -1.284632 -0.578099 0.037509
C  1.692646 -0.517908 -0.40904
C  0.945033 -0.778749 0.922347
C  1.86615 1.010722 -0.597989
C  -0.368697 0.012583 1.01013
C  0.507767 1.727821 -0.51058
C  3.045055 -1.258462 -0.444577
C  -2.657716 -0.03799 0.116965
C  -3.493593 -0.765857 -0.934969
H  1.053219 -0.895353 -1.232596
H  0.71746 -1.853957 1.040751
H  1.587729 -0.470575 1.770689
H  2.332966 1.228219 -1.579562
H  2.542805 1.4044 0.187311
H  -0.816376 -0.015699 2.024692
H  0.614115 2.824989 -0.528775
H  -0.147811 1.409625 -1.34726
H  3.70828 -0.906288 0.36951
H  2.908319 -2.349179 -0.32038
H  3.56951 -1.089306 -1.403906
H  -3.058739 -0.210094 1.140192
H  -2.636066 1.055396 -0.061485
H  -4.536919 -0.400757 -0.917979
H  -3.07993 -0.594823 -1.944114
H  -3.498884 -1.852944 -0.744076
