program: Gaussian 09
title: 000033155
version: EM64L-G09RevD.01
frameworkgroup: C1[X(C11H22N2)]
method: RPBEPBE
basis: SDD
operation: Freq
keyword: #pfreq=noraman
keyword: PBEPBE/SDD
title: #p freq=noraman PBEPBE/SDD
converged: YES YES NO NO
title: Mulliken charges:
elementType: N N C C C C C C C C C C C H H H H H H H H H H H H H H H H H H H H H H
charge: -0.106714 -0.021668 -0.366276 -0.365396 -0.355384 -0.350813 -0.366114 -0.339665 -0.339821 -0.428565 -0.692651 -0.692930 -0.155738 0.188500 0.206322 0.192405 0.197043 0.209244 0.184850 0.206003 0.188651 0.228251 0.217272 0.192726 0.192032 0.192952 0.192009 0.247233 0.266392 0.216967 0.210903 0.212157 0.217378 0.210010 0.212433
chargesum: 0.00000
title: Mulliken charges with hydrogens summed into heavy atoms:
elementType: N N C C C C C C C C C C C
charge: -0.106714 -0.021668 0.028546 0.024052 0.038710 0.043841 0.079409 0.045093 0.045140 0.085061 -0.052624 -0.053109 -0.155738
polarizability: 1.42960531e+02 -7.73706994e+00 1.48102862e+02 -7.62823879e-01 1.75070070e+00 1.05759957e+02
1716.lowfreq: -14.4165 -0.0005 -0.0003 0.0003 1.5124 9.7782 30.6025 38.5101 40.9651
frequency: 29.9091 38.4950 40.8537 54.1151 61.3222 73.8498 98.0742 111.3288 141.7760 151.8436 172.2661 226.5264 232.2478 238.8971 274.5601 288.2497 320.7138 372.2028 381.9938 432.2008 464.3084 497.5271 540.6379 730.4334 731.8188 769.4203 790.1407 792.6738 830.5332 898.7592 899.1660 924.3585 926.7281 936.4716 993.3815 1018.3394 1029.0990 1040.6954 1070.3061 1075.6659 1081.5872 1096.3247 1112.5936 1118.8174 1158.5567 1191.3185 1213.9873 1233.8093 1237.4807 1264.0012 1268.4185 1273.2861 1283.0925 1285.1416 1288.4889 1302.0258 1304.1705 1344.3683 1345.0405 1361.8524 1367.7862 1377.4687 1389.9836 1390.8955 1444.2816 1463.9805 1465.0178 1470.8437 1471.9735 1477.3022 1478.1269 1478.1588 1480.9127 1482.0259 1488.7930 1490.2572 2194.4954 2856.7376 2864.8016 2898.4504 2963.0558 2963.1669 2973.0720 2973.9434 2974.6915 2977.2016 3002.9735 3005.4222 3005.9818 3009.3553 3021.1372 3043.3492 3046.4171 3050.7173 3070.5365 3071.3057 3072.0452 3073.2213 3073.9388
redmass: 3.0159 5.1624 3.7154 1.7212 1.7743 2.1638 2.5815 2.2818 4.7022 2.8279 2.3178 1.5215 1.5407 1.2926 2.5690 2.5480 3.0970 3.5351 3.4221 3.2574 3.3769 3.0434 4.3490 1.0758 1.0740 1.2239 1.1943 1.1794 4.5478 1.7432 1.7429 1.3305 1.2532 3.4702 2.7145 3.4921 3.5532 2.4528 2.3115 2.3108 2.2485 1.9727 2.2884 2.1040 1.5716 2.0486 1.4195 1.4596 1.4472 1.2692 1.3231 1.3014 1.0700 1.0775 1.1357 1.2762 1.2872 1.5074 1.5281 1.3129 1.3977 1.3976 1.2163 1.2259 1.0822 1.0701 1.0728 1.0675 1.0709 1.0435 1.0453 1.0864 1.0700 1.0657 1.0875 1.0896 12.4215 1.0708 1.0704 1.0708 1.0589 1.0588 1.0468 1.0387 1.0508 1.0586 1.0920 1.0960 1.0617 1.0930 1.0898 1.1023 1.1006 1.0920 1.1007 1.1007 1.0999 1.0994 1.0994
irintensity: 0.2718 2.5794 0.8660 0.4844 0.9646 3.0547 0.1276 0.3735 4.7417 0.7068 0.2384 0.4568 0.2427 0.0346 0.4762 0.4475 2.9000 0.3811 1.7375 5.1425 6.0202 3.5497 6.4421 8.9881 8.7969 5.3234 0.0677 0.1375 9.6858 13.0145 8.5518 5.7431 4.7981 4.3811 6.9960 0.3187 3.5928 10.8443 19.0676 2.3792 35.7056 25.8921 1.0147 10.2175 8.8990 14.8111 5.4368 7.9912 7.2502 0.8774 4.1553 1.4825 0.1378 0.4388 1.0629 20.8127 15.2837 0.5668 1.1928 14.7562 11.9887 3.7848 7.1566 10.0019 9.4064 0.3666 0.7146 1.1988 1.7179 15.9432 14.2564 5.0290 3.6588 2.8923 18.7534 12.1876 18.1855 38.1492 111.8213 90.1889 16.0631 26.2573 27.4847 30.0111 57.2027 55.7403 18.4562 8.3086 4.9681 8.5413 6.8088 38.4733 54.1788 18.2541 70.7132 92.7731 40.4564 51.4367 51.1111
temp: 298.150 k
press: 1.00000 atm
elementType: 7 7 6 6 6 6 6 6 6 6 6 6 6 1 1 1 1 1 1 1 1 1 1 1 1 1 1 1 1 1 1 1 1 1 1
symmnumber: 1
zpe: 818664.9 jmol-1
zpe.correction: 0.311813 hartree
zpe.thermalcorrener: 0.328819 hartree
zpe.thermalcorrenthalpy: 0.329763 hartree
zpe.thermalcorrgfe: 0.264641 hartree
zpe.sumelectzpe: -540.767590 hartree
zpe.sumelectthermal: -540.750585 hartree
zpe.sumelectthermalent: -540.749640 hartree
zpe.sumelectthermalfe: -540.814763 hartree
dipole: 2.0649 -4.1412 0.3594
dipole: 4.6414
quadrupole: -84.6155 -108.1468 -82.2048
quadrupole: 12.5501 0.0402 -1.4765
quadrupole: 7.0402 -16.4912 9.4509 12.5501 0.0402 -1.4765
hfenergy: -541.0794035 hartree
pointgroup: C01 [X(C11H22N2)]
dipole: 1.4215331 -1.1262508 0.2129635 debye
polarizability: 149.8498919|-6.9796028|141.2892854|-0.2072313|-0.1510472|105.6841722 unknown
InChI: InChI=1S/C11H22N2/c1-3-5-9-13(10-6-4-2)11-7-8-12/h3-7,9-11H2,1-2H3
charge 0 multiplicity 1
35 atoms
N  0.028839 0.10203 0.257323
N  -3.552054 3.442386 -0.335157
C  -0.083496 -1.291128 0.766651
C  1.28541 0.785645 0.666117
C  -0.916715 -2.210116 -0.151212
C  2.505011 0.367756 -0.182592
C  -1.184048 0.914637 0.48255
C  -1.053702 -3.643299 0.412771
C  3.814268 1.045089 0.283513
C  -1.406998 1.902398 -0.702219
C  -1.875654 -4.570843 -0.507897
C  5.032414 0.640435 -0.574498
C  -2.587325 2.761485 -0.510954
H  -0.507358 -1.315063 1.802818
H  0.939075 -1.706181 0.840417
H  1.508094 0.612568 1.749465
H  1.139884 1.8780 0.55399
H  -0.438357 -2.236995 -1.149588
H  -1.929804 -1.783755 -0.300549
H  2.301014 0.620232 -1.241514
H  2.631598 -0.733119 -0.144199
H  -2.061072 0.247543 0.54792
H  -1.1449 1.49063 1.437469
H  -1.529039 -3.600231 1.414309
H  -0.04352 -4.075384 0.566621
H  4.005579 0.784623 1.344848
H  3.690267 2.147248 0.252109
H  -0.514797 2.543859 -0.829824
H  -1.517575 1.317576 -1.6334
H  -1.962196 -5.588133 -0.084137
H  -2.899414 -4.177824 -0.654631
H  -1.404832 -4.658506 -1.505067
H  5.956662 1.135128 -0.223881
H  5.198704 -0.452711 -0.536353
H  4.880835 0.918819 -1.634316
