program: Gaussian 09
title: 000033297
version: EM64L-G09RevD.01
frameworkgroup: C1[X(C21H26N2O4)]
method: RPBEPBE
basis: SDD
operation: Freq
keyword: #p
keyword: freq=noraman
keyword: PBEPBE/SDD
title: #p freq=noraman PBEPBE/SDD
converged: YES YES NO NO
title: Mulliken charges:
elementType: O O O O N N C C C C C C C C C C C C C C C C C C C C C H H H H H H H H H H H H H H H H H H H H H H H H H H
charge: -0.284718 -0.265027 -0.245414 -0.220769 -0.096446 -0.461362 -0.383969 -0.326176 -0.325228 -0.300268 -0.675299 -0.700143 0.230370 0.187333 0.505480 -0.357115 -0.323985 -0.342328 -0.444024 0.127569 0.135474 0.199476 -0.357506 -0.360159 -0.251120 -0.220605 -0.536018 0.216694 0.244140 0.182105 0.207123 0.183463 0.203648 0.224571 0.250222 0.210765 0.225773 0.207955 0.215839 0.257351 0.204405 0.269633 0.269980 0.311259 0.223035 0.322132 0.254544 0.244412 0.234157 0.230043 0.226312 0.218374 0.254044
chargesum: 0.00000
title: Mulliken charges with hydrogens summed into heavy atoms:
elementType: O O O O N N C C C C C C C C C C C C C C C C C C C C C
charge: -0.284718 -0.265027 -0.245414 -0.220769 -0.096446 -0.139230 0.076865 0.063053 0.061882 0.174525 -0.030806 -0.022549 0.230370 0.187333 0.505480 -0.087482 -0.054005 -0.031068 -0.220989 0.127569 0.135474 0.199476 -0.102962 -0.115748 -0.016963 0.009438 0.162712
polarizability: 4.51842399e+02 1.15301491e+01 2.45531669e+02 4.43946047e+00 -6.30770231e+00 1.66166712e+02
1716.lowfreq: -13.4918 -3.8527 -1.7726 -0.0017 0.0013 0.0024 5.4256 12.2199 21.0982
frequency: -4.8946 11.6438 21.0289 24.8449 35.2988 45.2207 49.7401 68.6137 72.6098 88.3536 94.4830 108.2477 111.2131 120.2975 137.6469 155.4121 166.2422 189.2097 223.0238 237.5079 246.6842 258.2579 267.5623 280.1134 292.9849 303.1207 315.2026 331.1014 332.9646 379.4957 385.6780 410.2152 413.6761 444.1585 454.8492 474.7111 494.6130 516.4853 523.4116 543.7939 563.0222 617.6323 632.9295 661.9276 666.6539 679.9281 702.5769 736.3527 750.5301 758.6109 759.4274 762.2834 765.0946 790.8689 798.1469 806.6856 829.2831 839.2459 857.4036 866.4808 886.0399 899.6533 917.1255 941.7903 974.5485 978.5624 983.3493 988.3514 1003.4999 1011.9756 1039.9745 1043.8811 1058.6771 1063.6848 1069.6463 1073.7754 1083.8346 1091.4042 1109.8470 1122.2383 1124.7626 1127.3376 1154.6938 1176.7761 1178.3190 1185.1195 1209.8615 1223.4570 1240.4282 1247.6510 1250.5196 1265.0530 1276.5479 1282.4802 1283.6325 1303.4517 1308.7695 1322.9094 1359.3327 1363.3012 1366.1126 1381.4244 1381.9231 1386.9690 1393.0190 1420.6939 1422.4787 1441.2632 1446.3123 1464.7402 1465.7664 1466.5803 1468.9161 1472.2599 1477.3479 1479.6217 1485.6498 1487.1558 1491.9209 1498.9074 1507.2258 1576.9341 1587.6700 1597.5934 1612.3874 1617.7447 1625.8183 2842.8918 2851.8388 2963.2218 2966.1638 2980.2420 2984.7233 3016.8408 3028.6982 3036.8010 3048.1983 3053.9976 3076.6635 3078.2195 3085.8749 3091.4105 3116.1304 3126.1857 3127.8372 3133.2038 3137.7408 3156.9719 3161.3985 3173.3310 3177.6390 3199.0625 3518.1144
redmass: 3.8598 4.9944 4.1041 4.3507 4.7943 4.1552 3.7932 2.9750 4.1546 6.3551 3.2879 2.2894 3.1119 4.8091 5.3372 3.0028 3.2945 3.8488 1.5759 1.9006 1.6798 2.2121 2.3984 2.1457 2.4583 2.5325 5.4610 5.9986 5.2615 4.9088 2.6945 4.8884 3.0033 4.8823 2.8365 3.9181 3.8181 3.1941 3.7226 4.3261 5.1476 5.8012 6.4074 1.7000 2.4014 4.2053 4.9368 2.9465 2.7681 4.1592 1.5379 3.2859 3.7593 1.5754 1.1778 1.2357 4.1742 1.4269 1.7474 5.1630 1.4863 7.2731 1.9255 1.3848 1.3658 1.3713 6.9965 2.3091 3.5442 1.3299 3.4480 2.9244 3.6005 2.9633 1.8747 2.4267 2.8344 1.7160 1.2580 1.4249 1.7079 1.5888 1.3792 1.0830 1.4331 1.2993 2.4056 3.3478 3.0912 1.5465 2.2657 2.4923 1.4728 1.1359 1.1988 1.4106 1.2858 1.2868 1.3154 1.3469 4.2630 9.2405 1.3390 1.2644 1.2300 2.7792 2.1665 1.4550 1.0957 1.0506 1.1997 1.0597 1.0506 1.0613 1.0790 1.9509 2.0455 1.0619 1.0658 1.0682 2.8997 7.2045 6.4683 6.0294 8.6389 5.5998 6.6770 1.0718 1.0710 1.0331 1.0584 1.0355 1.0356 1.0924 1.0990 1.0877 1.0573 1.1040 1.0988 1.0981 1.1008 1.1004 1.0903 1.0878 1.1100 1.0993 1.0892 1.0910 1.0935 1.0989 1.0943 1.0951 1.0765
irintensity: 0.5799 0.8079 0.6038 0.5123 0.2044 1.1456 1.2723 1.8890 1.1368 3.3204 4.7290 0.4908 0.1985 0.7048 0.9474 0.8114 1.1775 4.0966 1.2159 1.3946 1.0860 1.3259 1.5904 9.1289 2.5420 3.5078 19.6313 5.5060 3.3965 9.2401 11.2853 1.1298 0.0515 1.3526 1.7837 10.0826 10.7980 10.9521 5.1172 1.3348 3.4503 8.8346 12.3770 21.6951 26.9096 42.5213 11.9356 0.8613 4.1707 9.0378 95.0391 13.2319 4.1535 0.7945 7.1855 6.8944 7.4930 27.9654 8.3897 24.1286 47.1138 71.1918 2.0865 5.2512 0.1714 1.4416 42.2997 0.8812 75.0347 0.9265 172.8373 154.6634 120.7153 2.9548 127.3845 19.0983 7.4439 22.9422 0.1937 19.5335 18.2185 8.5512 8.2576 13.4987 120.6818 76.6985 48.8839 85.8536 328.6781 74.2267 133.5605 143.4964 28.4626 5.7309 16.1124 82.3266 3.6325 41.4777 9.9522 5.3399 412.2194 2.8600 11.2442 15.0165 16.8663 37.7186 34.4439 2.0762 19.7307 8.5333 81.0719 1.8673 13.6815 4.3065 3.4835 103.7875 151.3194 7.4079 15.2419 21.8791 295.1640 111.7983 57.3864 25.4826 196.6988 157.0139 168.6651 36.7818 204.0631 72.3272 32.3571 27.2111 36.6078 6.8375 29.7640 34.9606 37.3549 42.3604 29.7837 66.2274 34.6712 45.9365 19.1225 5.5113 13.3509 17.3971 7.6735 1.6329 19.8224 20.1365 2.2397 4.6170 13.6400
temp: 298.150 k
press: 1.00000 atm
elementType: 8 8 8 8 7 7 6 6 6 6 6 6 6 6 6 6 6 6 6 6 6 6 6 6 6 6 6 1 1 1 1 1 1 1 1 1 1 1 1 1 1 1 1 1 1 1 1 1 1 1 1 1 1
symmnumber: 1
zpe: 1135608.4 jmol-1
zpe.correction: 0.432530 hartree
zpe.thermalcorrener: 0.459269 hartree
zpe.thermalcorrenthalpy: 0.460213 hartree
zpe.thermalcorrgfe: 0.372031 hartree
zpe.sumelectzpe: -1224.217667 hartree
zpe.sumelectthermal: -1224.190929 hartree
zpe.sumelectthermalent: -1224.189985 hartree
zpe.sumelectthermalfe: -1224.278167 hartree
dipole: -3.7926 -4.3319 2.1322
dipole: 6.1397
quadrupole: -105.6486 -153.8380 -162.5760
quadrupole: -3.3504 -15.1714 3.9342
quadrupole: 35.0389 -13.1505 -21.8885 -3.3504 -15.1714 3.9342
hfenergy: -1224.6501979 hartree
pointgroup: C01 [X(C21H26N2O4)]
dipole: -1.490138 1.7517247 -0.7388113 debye
polarizability: 452.0403838|-10.1566643|245.9183473|-1.0249708|-0.8475375|165.5820487 unknown
InChI: InChI=1S/C21H26N2O4/c1-4-23(5-2)14-15-27-21(25)16-10-12-17(13-11-16)22-20(24)18-8-6-7-9-19(18)26-3/h6-13,22H,4-5,14-15H2,1-3H3
charge 0 multiplicity 1
53 atoms
O  3.623585 0.328615 -0.772295
O  3.432848 -1.720697 0.333673
O  -6.043038 -1.532751 -0.715074
O  -3.666122 -1.500691 1.095822
N  7.247678 0.339318 0.374434
N  -2.747991 0.379614 0.016903
C  5.781942 0.545359 0.479321
C  8.048148 1.585859 0.495974
C  7.74891 -0.7863 1.205533
C  5.102695 0.121439 -0.838991
C  9.439356 1.485604 -0.160181
C  7.19817 -2.157048 0.767148
C  1.436109 -0.393549 -0.11206
C  2.892596 -0.686673 -0.141365
C  -1.363585 0.075435 -0.001435
C  0.567582 -1.328598 0.508407
C  0.88737 0.785934 -0.681742
C  -0.81956 -1.109603 0.570183
C  -0.49567 1.016657 -0.627015
C  -5.13801 0.345194 0.456192
C  -3.810078 -0.369879 0.553143
C  -6.27664 -0.29278 -0.122371
C  -5.290004 1.633204 1.023226
C  -7.537007 0.355315 -0.106658
C  -6.544066 2.285376 1.03763
C  -7.663851 1.637162 0.474077
C  -7.187729 -2.260858 -1.270628
H  5.54583 1.608505 0.681785
H  5.350641 -0.046169 1.311569
H  8.163181 1.900932 1.565361
H  7.483622 2.390844 -0.010997
H  7.510549 -0.621262 2.288352
H  8.850391 -0.804019 1.121111
H  5.43124 0.75412 -1.677967
H  5.311385 -0.939212 -1.053689
H  10.087261 0.746965 0.344637
H  9.338719 1.186229 -1.218229
H  9.953394 2.463823 -0.114481
H  7.483683 -2.36765 -0.279181
H  6.096925 -2.207847 0.84294
H  7.615705 -2.954374 1.409982
H  1.002925 -2.23518 0.941527
H  1.553612 1.507332 -1.161942
H  -1.487836 -1.831269 1.041783
H  -0.912553 1.930242 -1.070163
H  -3.021066 1.246675 -0.453615
H  -4.423018 2.112441 1.493628
H  -8.415072 -0.12584 -0.546736
H  -6.644837 3.275288 1.493216
H  -8.643966 2.126768 0.483333
H  -7.945401 -2.469119 -0.491249
H  -7.652642 -1.703744 -2.107386
H  -6.766209 -3.206034 -1.641043
