program: Gaussian 09
title: 000033176
version: EM64L-G09RevD.01
frameworkgroup: C1[X(C19H16ClNO4)]
method: RPBEPBE
basis: SDD
operation: Freq
keyword: #p
keyword: freq=noraman
keyword: PBEPBE/SDD
title: #p freq=noraman PBEPBE/SDD
converged: YES YES NO NO
title: Mulliken charges:
elementType: Cl O O O O N C C C C C C C C C C C C C C C C C C C H H H H H H H H H H H H H H H H
charge: -0.053092 -0.262137 -0.252906 -0.412318 -0.199201 -0.222872 0.263505 0.131909 0.237351 0.087604 -0.511708 -0.532530 -0.323529 -0.806099 -0.029489 0.327121 -0.389279 0.314031 0.201207 -0.361172 -0.363146 -0.222718 -0.216057 -0.115277 -0.536221 0.286569 0.278283 0.247739 0.257620 0.232266 0.306605 0.237685 0.252415 0.281763 0.275799 0.259564 0.257526 0.248706 0.219042 0.217592 0.387847
chargesum: 0.00000
title: Mulliken charges with hydrogens summed into heavy atoms:
elementType: Cl O O O O N C C C C C C C C C C C C C C C C C C C
charge: -0.053092 -0.262137 -0.252906 -0.024472 -0.199201 -0.222872 0.263505 0.131909 0.237351 0.087604 0.053144 -0.284790 -0.065909 -0.029544 -0.029489 0.327121 -0.136864 0.314031 0.201207 -0.079409 -0.087347 0.036846 0.041469 -0.115277 0.149120
polarizability: 3.50351081e+02 3.28311367e+00 2.54501565e+02 -1.94139318e+00 2.41533998e+01 1.52702725e+02
1716.lowfreq: -2.8801 -1.1182 0.0012 0.0013 0.0018 4.0219 20.4574 25.4809 26.6339
frequency: 20.4264 25.4628 26.5700 33.5746 49.4976 59.8139 76.5404 101.2410 108.8241 133.5131 144.6475 152.5750 178.7333 187.7953 197.2925 218.7087 250.7969 261.0636 280.6730 288.9802 302.6452 326.7912 345.7171 383.1999 390.5427 404.3350 412.1403 437.2880 451.5066 468.2350 477.6952 492.0498 538.5711 550.9580 586.1309 594.2324 622.4115 623.0083 638.1880 640.0990 680.3564 695.4314 714.9458 730.8997 741.1824 768.1769 811.4044 824.6187 827.6441 836.4945 843.0036 853.1828 905.2246 912.3346 957.1649 965.7860 976.1696 977.9461 998.0703 1001.8128 1025.7515 1039.5191 1045.0146 1069.1346 1076.9810 1107.2963 1113.1582 1134.0115 1148.1053 1158.9588 1181.6205 1202.7844 1213.8669 1252.5249 1260.1615 1279.3235 1292.4142 1315.8244 1353.5449 1366.5647 1373.0353 1391.4922 1393.8567 1406.3994 1409.0517 1433.6800 1439.2649 1455.9313 1466.1312 1466.8501 1471.3701 1475.9998 1483.8710 1486.9766 1515.4668 1545.6245 1578.4716 1582.6862 1592.6895 1631.0900 1687.2529 2953.1800 2968.0764 3022.7566 3038.7795 3039.8685 3078.9904 3120.2938 3124.3473 3152.4179 3154.5743 3156.9223 3157.7223 3172.3214 3176.0402 3177.8981 3518.2457
redmass: 9.5188 7.7509 9.0000 8.1716 3.7142 5.5989 5.7151 6.0291 3.3957 3.9618 3.8139 1.3355 3.9893 3.1645 6.5716 2.1389 4.3111 2.2662 3.5594 3.6500 5.1665 4.6732 5.7204 6.6377 6.0459 5.3846 3.0795 2.9687 5.0271 4.0293 2.1738 3.9915 5.1415 4.6813 5.2319 3.8702 6.5346 2.9162 2.2231 2.5951 5.8149 4.8042 6.0027 5.8407 3.1613 3.4645 1.8056 1.8950 2.9192 1.3143 2.9267 2.3242 3.5425 4.2250 1.3265 1.4601 2.3756 1.4032 4.9520 3.7212 2.4378 2.6285 1.5123 3.0428 2.1469 1.3491 1.2609 1.6493 1.7019 1.5649 1.1384 2.4784 2.0746 2.9945 1.7360 1.6387 1.2529 2.4240 1.6763 4.6802 4.4879 3.8342 1.7125 4.7047 2.7226 1.3081 1.1315 1.3191 1.8841 1.0770 2.2809 1.3790 1.5881 1.7418 6.7160 5.9832 8.0256 8.1522 6.3257 7.2346 8.9250 1.0334 1.0408 1.0608 1.1037 1.0966 1.1007 1.0948 1.0987 1.0887 1.0886 1.0893 1.0893 1.0965 1.0976 1.0969 1.0643
irintensity: 0.8086 0.3359 1.1652 0.1436 0.5120 0.9806 1.4326 8.5886 0.0857 3.1978 0.9335 0.1783 1.2198 0.7742 0.4850 2.3425 1.1575 6.9742 2.5581 3.0453 1.1155 1.7332 0.0142 15.3406 5.9754 7.9093 0.2987 3.9220 9.2106 16.7271 17.6944 12.2970 22.9509 36.5862 20.2426 3.7002 0.5368 33.9982 60.5665 62.0512 8.9912 4.3941 2.8393 14.5860 12.8844 18.4941 5.8297 70.5228 12.3021 4.6573 30.3718 26.1768 33.1627 81.4055 1.1008 4.7480 23.9473 9.2740 99.9062 12.7198 10.9591 378.1321 20.7613 64.1048 12.7930 9.3794 0.1723 45.6105 61.9159 49.2752 10.4341 66.4682 13.7451 156.7446 28.3638 26.0866 0.4373 20.1973 19.9717 0.5520 36.2115 4.0486 45.6777 161.3750 129.2159 20.8037 63.0718 4.2321 68.8865 18.4537 28.4135 30.2962 37.3864 60.0204 236.5390 267.8238 9.7451 23.5309 100.5819 81.0519 167.7875 67.6368 43.6605 21.3729 48.7045 16.6923 1.0732 0.0280 25.9120 3.7259 0.1494 12.0394 1.4339 5.0783 1.6286 7.3006 36.9888
temp: 298.150 k
press: 1.00000 atm
elementType: 17 8 8 8 8 7 6 6 6 6 6 6 6 6 6 6 6 6 6 6 6 6 6 6 6 1 1 1 1 1 1 1 1 1 1 1 1 1 1 1 1
symmnumber: 1
zpe: 804132.8 jmol-1
zpe.correction: 0.306278 hartree
zpe.thermalcorrener: 0.329465 hartree
zpe.thermalcorrenthalpy: 0.330409 hartree
zpe.thermalcorrgfe: 0.250866 hartree
zpe.sumelectzpe: -1547.567335 hartree
zpe.sumelectthermal: -1547.544148 hartree
zpe.sumelectthermalent: -1547.543204 hartree
zpe.sumelectthermalfe: -1547.622747 hartree
dipole: -7.4054 0.2932 0.6765
dipole: 7.4420
quadrupole: -125.4492 -152.8994 -154.3648
quadrupole: 3.2772 -7.7873 -0.8658
quadrupole: 18.7886 -8.6616 -10.1270 3.2772 -7.7873 -0.8658
hfenergy: -1547.8736131 hartree
pointgroup: C01 [X(C19H16Cl1N1O4)]
dipole: 2.7793854 -0.9206425 -0.0023765 debye
polarizability: 337.0045188|-38.2730946|225.8348325|-2.7591183|-57.4381728|194.71602 unknown
InChI: InChI=1S/C19H16ClNO4/c1-11-18(19(24)12-3-5-13(20)6-4-12)15-8-7-14(25-2)9-16(15)21(11)10-17(22)23/h3-9,22H,10H2,1-2H3
charge 0 multiplicity 1
41 atoms
Cl -5.968429 2.319363 -2.291372
O  3.595749 2.716512 -1.340884
O  -2.341731 -1.139932 2.289746
O  4.385599 -3.682533 -0.126985
O  2.28126 -3.397313 -1.087051
N  1.725769 -1.360937 0.905546
C  1.757424 -0.09487 0.285048
C  0.427511 0.431666 0.310567
C  0.416493 -1.653093 1.318611
C  -0.419468 -0.573541 0.959143
C  2.874237 -2.238433 1.038722
C  2.866125 0.598517 -0.250399
C  0.223973 1.745138 -0.194235
C  0.079678 -2.958251 1.975018
C  -1.859118 -0.524915 1.275478
C  2.615074 1.890517 -0.765017
C  1.307602 2.459482 -0.726307
C  -2.808217 0.229891 0.380231
C  3.096468 -3.138122 -0.184402
C  -2.594307 0.360625 -1.017095
C  -4.010897 0.731223 0.944654
C  -3.556136 0.987862 -1.838415
C  -4.972336 1.378189 0.143066
C  -4.726573 1.494969 -1.240745
C  4.960548 2.195571 -1.413484
H  2.747854 -2.900339 1.914075
H  3.791787 -1.653222 1.220096
H  3.866442 0.157126 -0.271382
H  -0.766813 2.206767 -0.171286
H  0.562015 -3.055327 2.968027
H  -1.005155 -3.005617 2.14691
H  0.391524 -3.819162 1.3533
H  1.178676 3.469627 -1.125641
H  -1.684703 -0.044913 -1.470731
H  -4.181312 0.593924 2.017219
H  -3.400148 1.076737 -2.917245
H  -5.893019 1.777417 0.577756
H  5.546952 2.989225 -1.89909
H  5.007775 1.271722 -2.023596
H  5.371069 1.995392 -0.403751
H  4.52386 -4.306845 -0.8900
