program: Gaussian 09
title: 000033105
version: EM64L-G09RevD.01
frameworkgroup: C1[X(C9H8O)]
method: RPBEPBE
basis: SDD
operation: Freq
keyword: #p
keyword: freq=noraman
keyword: PBEPBE/SDD
title: #p freq=noraman PBEPBE/SDD
converged: NO YES NO NO
title: Mulliken charges:
elementType: O C C C C C C C C C H H H H H H H H
charge: -0.243138 -0.004192 0.274888 0.360673 -0.416708 -0.348490 -0.370716 -0.224270 -0.802792 -0.161848 0.244609 0.231178 0.261345 0.222454 0.231676 0.253637 0.231464 0.260227
chargesum: 0.00000
title: Mulliken charges with hydrogens summed into heavy atoms:
elementType: O C C C C C C C C C
charge: -0.243138 -0.004192 0.274888 0.360673 -0.172099 -0.117312 -0.109371 -0.001816 -0.086014 0.098379
polarizability: 1.27899265e+02 4.56713252e+00 1.10214821e+02 1.39121578e-03 -1.42544521e-02 4.46609631e+01
1716.lowfreq: -54.1436 -0.0009 -0.0008 -0.0006 5.8898 11.4754 15.1922 168.4156 210.3872
frequency: -53.6804 168.4120 210.3867 243.2034 272.2623 447.4974 489.3418 497.1677 563.1727 584.8584 591.4671 646.2975 740.1446 757.6983 795.3320 816.6951 854.0804 865.4891 896.6033 961.0071 969.3032 993.4565 1038.2579 1043.8050 1076.9049 1111.9007 1147.0687 1182.7013 1243.4010 1270.8255 1327.0720 1395.0326 1404.1644 1415.1363 1467.5839 1478.1374 1478.8057 1530.4526 1604.9201 1630.0685 2984.0966 3060.8785 3103.4462 3122.8192 3140.2326 3161.5169 3219.8769 3261.4283
redmass: 1.0268 3.6156 4.0746 3.0775 3.7901 3.6359 6.1809 3.4179 3.8751 5.6557 3.4831 5.5440 2.0437 1.3708 1.6984 5.5362 6.3789 1.3388 1.3931 1.9694 1.3221 2.8906 2.8900 1.5004 1.6943 1.4475 2.6200 1.3714 1.6732 1.9174 2.7190 1.4665 1.9568 5.8630 1.8130 1.0501 1.5298 4.7280 7.0759 7.8457 1.0378 1.0978 1.0984 1.0871 1.0912 1.0989 1.0923 1.1072
irintensity: 0.2562 4.1409 8.4246 2.2736 2.1169 3.0381 3.7242 0.2004 0.4721 0.5123 0.5676 1.8449 63.6940 0.0934 78.9182 9.0906 5.8642 9.9619 4.0782 2.1690 1.1349 16.2563 9.7058 7.9130 12.8990 12.5000 42.3720 1.5929 1.1303 1.6543 9.6066 18.9221 9.0354 0.8461 18.7953 14.2206 10.6815 2.9582 4.2521 4.6936 28.1586 19.5403 8.2941 6.2062 15.9481 25.3336 2.3022 1.0863
temp: 298.150 k
press: 1.00000 atm
elementType: 8 6 6 6 6 6 6 6 6 6 1 1 1 1 1 1 1 1
symmnumber: 1
zpe: 372423.9 jmol-1
zpe.correction: 0.141849 hartree
zpe.thermalcorrener: 0.149048 hartree
zpe.thermalcorrenthalpy: 0.149992 hartree
zpe.thermalcorrgfe: 0.110163 hartree
zpe.sumelectzpe: -422.269854 hartree
zpe.sumelectthermal: -422.262655 hartree
zpe.sumelectthermalent: -422.261711 hartree
zpe.sumelectthermalfe: -422.301540 hartree
dipole: -0.1350 0.4494 0.0006
dipole: 0.4693
quadrupole: -47.6992 -54.0544 -62.6714
quadrupole: -1.3538 0.0014 -0.0019
quadrupole: 7.1092 0.7539 -7.8631 -1.3538 0.0014 -0.0019
hfenergy: -422.4117027 hartree
pointgroup: C01 [X(C9H8O1)]
dipole: -0.0342739 0.1814205 0.0002337 debye
dipolederiv: -0.6789778 0.1788479 -0.0000594 -0.1617393 -0.5864271 -0.000007 0.0000366 0.0001313 -0.1333949 0.2591322 0.1547057 -0.0000566 0.4369604 0.0661643 -0.000023 -0.0000831 -0.0000274 0.0065005 0.196846 0.1617312 0.0000306 -0.045132 -0.1240775 -0.000017 -0.0000149 0.0000373 0.0555778 0.1038732 -0.1527228 0.0000966 -0.1518529 0.299362 -0.0002505 0.0004173 -0.001027 -0.0171126 -0.0020329 -0.0513036 -0.0000029 0.0081088 0.0613595 0.0000454 -0.0000201 0.0000024 -0.1945239 -0.0029175 -0.0619938 0.0001115 -0.0214739 -0.130391 -0.0000213 0.0000801 0.0001125 -0.2105902 -0.0218134 -0.1640974 0.0000233 -0.020761 -0.1500475 -0.000003 -0.0000145 -0.0000289 -0.2375607 -0.0122693 0.0712068 -0.0001028 0.0965032 0.0598814 -0.0000472 -0.0000907 0.0000382 -0.1577473 -0.0026755 0.1087488 -0.0002007 0.0397868 -0.1020376 0.0000797 -0.000837 0.0012881 0.0743084 0.1544002 -0.2433074 0.0000537 -0.2394762 0.479967 -0.0000481 0.0000471 -0.0000839 -0.1218814 0.0625005 0.0695579 0.0000015 0.0386298 -0.0860092 0.0000153 0.0000031 -0.0000036 0.1703444 -0.113588 0.046186 0.0000021 0.0565228 0.0756288 -0.0000359 0.0000961 -0.0000705 0.1574516 0.0222716 0.0565222 -0.0000033 0.0998156 0.0421258 0.0000181 -0.0000134 0.000017 0.1978762 -0.0229391 -0.1172563 0.0000291 -0.1098609 -0.0398195 0.0000128 0.000052 0.0000127 0.1612609 0.0259717 0.0557549 -0.1109821 0.0363489 0.0206263 0.0106109 -0.116883 0.0711437 -0.0408095 -0.0054375 -0.1387511 -0.0009669 -0.04732 0.0158017 -0.0004885 -0.0005137 -0.0009676 0.1150805 0.0236002 0.0559987 0.1120297 0.0355888 0.0213639 -0.0098474 0.1177396 -0.0705741 -0.0388002 0.0140552 -0.0298277 -0.0000032 -0.0506489 0.0765287 0.0000066 -0.0000017 0. 0.2140203 unknown
polarizability: 128.6573528|2.622524|109.4567327|-0.0001112|-0.0143218|44.6609631 unknown
InChI: InChI=1S/C9H8O/c1-7-3-2-4-8-5-6-10-9(7)8/h2-6H,1H3
charge 0 multiplicity 1
18 atoms
O  -1.290078 -1.35646 0.000358
C  -0.193623 -0.45837 0.000268
C  -0.673967 0.8860 0.0002
C  1.162822 -0.831571 0.000245
C  0.266876 1.946057 0.000086
C  2.072813 0.25629 0.000098
C  -2.128206 0.79818 0.000187
C  1.637248 1.610921 0.000077
C  1.608833 -2.281152 0.000497
C  -2.449111 -0.542086 0.000255
H  -0.058048 2.991574 0.000021
H  3.148129 0.039627 -0.000039
H  -2.83626 1.624764 0.000099
H  2.38947 2.407695 -0.000041
H  2.220255 -2.507619 0.893673
H  0.744877 -2.964893 -0.00477
H  2.229501 -2.505059 -0.886873
H  -3.392131 -1.082798 0.000258
