program: Gaussian 09
title: 000033204
version: EM64L-G09RevD.01
frameworkgroup: C1[X(C16H28N2O)]
method: RPBEPBE
basis: SDD
operation: Freq
keyword: #p
keyword: freq=noraman
keyword: PBEPBE/SDD
title: #p freq=noraman PBEPBE/SDD
converged: YES YES NO NO
title: Mulliken charges:
elementType: O N N C C C C C C C C C C C C C C C C H H H H H H H H H H H H H H H H H H H H H H H H H H H H
charge: -0.284620 -0.130627 -0.699322 -0.029902 -0.045707 -0.403971 -0.240970 -0.698991 -0.692454 -0.693219 -0.688340 -0.225834 -0.574184 0.486614 -0.439096 -0.371723 -0.409154 -0.413822 0.482183 0.194648 0.201470 0.212650 0.211858 0.199185 0.187918 0.209876 0.205916 0.236217 0.209427 0.201014 0.226325 0.208984 0.208031 0.218248 0.228049 0.206940 0.201180 0.194118 0.187378 0.197257 0.223862 0.221206 0.262986 0.210084 0.209016 0.299304 0.299991
chargesum: 0.00000
title: Mulliken charges with hydrogens summed into heavy atoms:
elementType: O N N C C C C C C C C C C C C C C C C
charge: -0.284620 -0.130627 -0.100028 0.164747 0.155763 0.020537 0.146132 -0.046982 -0.055687 -0.057956 -0.052171 0.155663 -0.153065 0.486614 -0.217890 -0.108736 -0.199071 -0.204806 0.482183
polarizability: 2.29935205e+02 -1.89228073e+01 2.05349486e+02 -1.52997389e+01 -1.07737429e+01 1.49027187e+02
1716.lowfreq: -21.4667 -7.7001 -2.8719 -0.0009 -0.0007 -0.0002 3.4411 7.6481 20.3307
frequency: -17.4000 6.3583 20.1733 33.7264 42.5287 58.9895 93.8215 104.6252 122.2210 131.8415 141.5904 172.7630 182.7907 205.0029 215.4537 232.9095 245.4618 250.8820 272.5558 291.7140 303.2782 317.5846 340.9652 353.5630 354.4879 382.3665 388.6142 397.6973 410.9317 456.5488 476.4690 481.9485 519.6055 553.6040 563.5419 638.8555 699.5077 713.0289 736.6727 789.9913 812.3838 821.7410 825.0823 827.1125 834.6419 875.0278 897.0375 900.6686 922.8903 925.9387 931.9477 955.4842 961.7425 975.9938 982.0978 1004.1525 1015.4632 1026.7408 1051.3428 1073.6257 1086.2940 1091.3465 1116.0882 1125.9984 1126.8005 1143.7533 1161.4406 1167.3860 1183.4509 1189.5908 1212.8536 1218.5931 1234.4099 1239.5859 1289.3649 1298.0362 1307.2894 1308.1226 1310.6067 1317.9861 1336.5259 1353.7283 1362.4647 1365.3392 1368.0409 1378.9648 1384.1377 1385.0495 1390.0769 1394.9786 1432.6913 1452.8658 1455.8840 1459.1038 1462.7366 1465.5511 1470.7521 1472.3752 1475.6028 1480.7189 1483.0589 1485.4761 1488.2804 1519.3206 1581.4809 1631.2925 1642.9463 2911.7825 2925.1732 2931.4493 2965.4201 2968.6426 2971.9901 2976.2795 2977.2928 2977.9326 2979.6413 2986.3898 2999.6907 3038.2730 3049.5342 3060.0431 3062.1430 3068.6902 3069.9024 3074.2771 3086.1214 3088.6989 3092.6770 3102.4851 3111.3219 3128.0120 3155.8465 3569.6291 3710.5788
redmass: 3.5060 4.1672 3.2845 3.0344 3.8012 2.8056 2.6612 3.1780 2.8781 4.0427 3.0107 2.3403 1.1735 1.1575 2.5372 2.3294 1.2637 1.0919 2.3336 2.6776 1.2433 2.4900 2.5117 1.0414 3.6403 2.6163 2.2586 3.0243 2.7332 3.9362 2.9238 2.9096 2.7489 2.3610 2.4020 6.3539 2.9414 3.6004 3.0787 1.2610 1.3610 2.3626 3.5534 1.9910 2.2428 2.4192 1.2788 1.3237 1.2930 1.3739 1.3632 1.4711 2.1901 2.8683 1.7942 2.7409 1.5755 2.5876 2.3425 3.2425 2.5249 1.6723 2.2521 2.1761 1.2818 1.8996 1.9277 1.4900 1.2094 1.1188 2.6354 2.0115 1.2445 1.6919 1.1773 1.3564 1.3191 2.8026 1.2744 1.3381 1.5518 1.3101 1.2374 1.3176 1.2241 1.2455 1.3880 3.3360 1.2965 1.3968 3.0410 1.1151 1.0515 1.0532 1.0585 1.0576 1.0671 1.0598 1.0517 1.0607 1.0650 1.0628 1.0611 3.0421 6.6424 1.8082 2.1509 1.0561 1.0586 1.0656 1.0936 1.0346 1.0373 1.0852 1.0379 1.0455 1.0883 1.0718 1.0838 1.1000 1.0940 1.0990 1.0994 1.0994 1.0983 1.0993 1.0999 1.0999 1.0984 1.0865 1.0891 1.0963 1.0948 1.0447 1.1040
irintensity: 0.1208 0.1034 0.0142 0.0576 0.2513 0.1941 0.3593 4.0632 1.6789 4.5930 9.0132 1.1254 0.0331 0.1026 1.0718 2.4553 0.2209 0.0609 0.5874 2.7756 307.0634 6.3922 4.0588 0.0249 4.7781 1.3413 1.6502 1.7692 0.1859 0.9421 10.9011 5.6647 10.0687 6.5514 22.4906 0.7059 4.0240 4.2213 3.8949 2.5568 18.1264 29.3936 9.7670 33.0287 2.2910 3.3225 0.9349 1.5947 0.7504 0.5323 0.1318 1.5717 4.7093 21.2858 7.7759 3.0063 21.3355 75.3193 62.5200 67.9058 10.6638 33.4350 3.9906 34.4202 13.8275 22.2042 14.4576 49.0656 3.2627 16.6042 66.3491 0.1394 2.5094 49.2729 11.8447 5.8347 11.4931 52.1752 9.2823 12.1861 7.8122 10.0918 5.7089 14.3334 41.4861 16.9592 10.5988 5.7884 29.8230 4.2681 1.4343 12.8785 0.5520 2.1716 3.1218 3.2020 24.8214 2.5406 11.7651 9.0275 3.0887 14.1433 4.9347 138.0029 5.6247 2.5463 262.7102 53.7595 24.8384 111.3592 25.0207 26.7121 17.1120 23.2976 38.6190 36.1337 42.8928 84.2640 16.6064 27.3192 37.5669 0.3464 5.9557 68.8247 67.1616 119.3514 22.7683 47.7429 34.6560 18.3264 28.4490 33.3512 5.0139 59.3799 17.9156
temp: 298.150 k
press: 1.00000 atm
elementType: 8 7 7 6 6 6 6 6 6 6 6 6 6 6 6 6 6 6 6 1 1 1 1 1 1 1 1 1 1 1 1 1 1 1 1 1 1 1 1 1 1 1 1 1 1 1 1
symmnumber: 1
zpe: 1080671.4 jmol-1
zpe.correction: 0.411606 hartree
zpe.thermalcorrener: 0.433488 hartree
zpe.thermalcorrenthalpy: 0.434432 hartree
zpe.thermalcorrgfe: 0.358229 hartree
zpe.sumelectzpe: -809.688894 hartree
zpe.sumelectthermal: -809.667012 hartree
zpe.sumelectthermalent: -809.666068 hartree
zpe.sumelectthermalfe: -809.742271 hartree
dipole: -0.2958 1.5918 0.8537
dipole: 1.8303
quadrupole: -101.0095 -106.7224 -120.3460
quadrupole: -8.9904 -4.7895 -4.3981
quadrupole: 8.3498 2.6369 -10.9867 -8.9904 -4.7895 -4.3981
hfenergy: -810.1005 hartree
pointgroup: C01 [X(C16H28N2O1)]
dipole: -0.0868517 0.3224566 0.6379942 debye
polarizability: 226.8357722|-4.1398766|196.9320074|-28.9952476|21.6489285|160.5440983 unknown
InChI: InChI=1S/C16H28N2O/c1-13(2)18(14(3)4)10-12-19-11-9-15-5-7-16(17)8-6-15/h5-8,13-14H,9-12,17H2,1-4H3
charge 0 multiplicity 1
47 atoms
O  -0.111943 -1.005379 -0.821955
N  3.306823 0.24042 0.059304
N  -5.676472 1.959898 1.581273
C  4.535071 0.25507 -0.77626
C  3.299376 0.98221 1.348538
C  2.006044 0.161877 -0.630691
C  1.198831 -1.063298 -0.163992
C  4.590677 1.372135 -1.862338
C  4.766531 -1.132132 -1.426664
C  3.520491 2.518613 1.219994
C  4.284689 0.370284 2.372955
C  -0.960464 -2.159039 -0.489151
C  -2.347528 -1.943977 -1.123167
C  -3.218527 -0.914326 -0.415987
C  -4.436951 -1.290692 0.204027
C  -2.844538 0.454892 -0.348806
C  -5.255598 -0.352513 0.867316
C  -3.649973 1.40475 0.308481
C  -4.872938 1.017025 0.929751
H  5.376081 0.434088 -0.07833
H  2.279286 0.835223 1.758687
H  2.15188 0.081049 -1.722788
H  1.384717 1.070269 -0.466325
H  1.73585 -1.997741 -0.438234
H  1.072673 -1.050375 0.94172
H  5.570616 1.356493 -2.37619
H  3.811987 1.223491 -2.634037
H  4.448798 2.373462 -1.421648
H  3.945262 -1.382698 -2.124928
H  5.711467 -1.147651 -2.002059
H  4.807065 -1.915912 -0.6505
H  3.3433 3.01933 2.190765
H  4.556829 2.747258 0.909484
H  2.829247 2.957925 0.477151
H  4.095642 -0.711544 2.484743
H  4.168575 0.857258 3.359184
H  5.337172 0.50612 2.061001
H  -1.045151 -2.262365 0.615264
H  -0.491572 -3.084784 -0.894003
H  -2.869601 -2.920469 -1.134737
H  -2.178685 -1.659405 -2.180844
H  -4.757059 -2.340364 0.167508
H  -1.901558 0.765268 -0.810679
H  -6.193811 -0.677073 1.335342
H  -3.336806 2.456435 0.343199
H  -6.551074 1.685662 2.017706
H  -5.402931 2.936735 1.620621
