program: Gaussian 09
title: 000033104
version: EM64L-G09RevD.01
frameworkgroup: C1[X(C9H8O)]
method: RPBEPBE
basis: SDD
operation: Freq
keyword: #p
keyword: freq=noraman
keyword: PBEPBE/SDD
title: #p freq=noraman PBEPBE/SDD
converged: NO YES NO NO
title: Mulliken charges:
elementType: O C C C C C C C C C H H H H H H H H
charge: -0.238336 0.085142 0.333783 0.183930 -0.369071 -0.371964 -0.364437 -0.801003 -0.205889 -0.173249 0.255659 0.227046 0.251820 0.227345 0.235677 0.235681 0.226754 0.261111
chargesum: 0.00000
title: Mulliken charges with hydrogens summed into heavy atoms:
elementType: O C C C C C C C C C
charge: -0.238336 0.085142 0.333783 0.183930 -0.113411 -0.144917 -0.112617 -0.102301 0.020865 0.087862
polarizability: 1.26375221e+02 6.69847768e+00 1.11360160e+02 1.60241294e-04 -2.33510280e-03 4.45873960e+01
1716.lowfreq: -104.3188 -10.4052 -6.2438 -0.0004 0.0006 0.0010 12.9439 168.7547 216.8377
frequency: -104.3162 168.7541 216.8362 262.4192 262.6082 443.9355 489.6068 496.0170 572.9126 576.6796 584.8129 654.9053 734.8474 763.8773 782.2983 811.5566 863.0663 878.7122 892.9778 939.7375 963.7014 990.3878 1010.9001 1039.0308 1067.4602 1127.9097 1162.3966 1179.5635 1238.6661 1263.9774 1323.2585 1395.1215 1402.4702 1419.3718 1472.1113 1472.6723 1482.0795 1522.4509 1604.5365 1621.2260 2979.6382 3055.6757 3091.4303 3121.8331 3148.9177 3177.3566 3220.4284 3261.6755
redmass: 1.0233 3.4337 4.3348 2.9570 3.7658 3.9525 5.5218 3.4185 5.4554 3.8035 3.6032 6.1368 1.7896 1.3857 1.9183 5.8510 1.3634 4.5932 1.3358 2.5100 1.3156 2.3775 2.9084 1.5290 1.6031 1.4417 1.4568 1.8843 2.4157 2.0440 2.1790 1.4069 2.2042 5.5416 1.0455 1.2201 2.6538 4.7815 7.0277 8.0044 1.0378 1.0977 1.0978 1.0880 1.0922 1.0974 1.0920 1.1071
irintensity: 0.3907 0.0026 7.2428 0.2009 6.5992 8.3089 1.8725 0.4517 0.5597 1.2457 0.3227 0.3130 6.6802 130.4700 13.6669 5.1928 6.4572 0.8116 0.0792 3.9542 1.6690 5.2937 32.5221 7.4551 9.6029 37.1255 5.8872 3.4174 5.9460 2.3709 9.4429 6.9261 18.4272 9.7422 12.2177 16.2345 17.9036 6.8835 7.7828 6.8071 30.1511 19.1399 18.5227 12.9073 17.7723 9.6257 2.1190 0.9607
temp: 298.150 k
press: 1.00000 atm
elementType: 8 6 6 6 6 6 6 6 6 6 1 1 1 1 1 1 1 1
symmnumber: 1
zpe: 372115.2 jmol-1
zpe.correction: 0.141731 hartree
zpe.thermalcorrener: 0.148918 hartree
zpe.thermalcorrenthalpy: 0.149862 hartree
zpe.thermalcorrgfe: 0.110064 hartree
zpe.sumelectzpe: -422.269241 hartree
zpe.sumelectthermal: -422.262054 hartree
zpe.sumelectthermalent: -422.261110 hartree
zpe.sumelectthermalfe: -422.300908 hartree
dipole: 0.8815 -1.3106 0.0001
dipole: 1.5795
quadrupole: -52.4711 -50.9700 -62.6637
quadrupole: 3.0045 -0.0002 -0.0005
quadrupole: 2.8972 4.3982 -7.2955 3.0045 -0.0002 -0.0005
hfenergy: -422.4109721 hartree
pointgroup: C01 [X(C9H8O1)]
dipole: 0.2914753 0.5488071 -0.0000413 debye
dipolederiv: -0.6453669 0.1714078 -0.0000057 -0.1505505 -0.5984314 0.0000124 0.0000147 0.000033 -0.1402344 0.032218 -0.1361527 0.0000016 -0.2952994 -0.1841352 0.0000078 0.0000161 0.0000063 0.0084328 0.1589505 0.1159601 -0.000004 0.1995942 0.3603939 -0.0000163 -0.000014 -0.000037 -0.0258703 0.5406987 -0.1394759 -0.000005 0.152059 0.0491981 0.0000024 -0.000005 0.0000018 0.0540848 -0.1603746 -0.1380672 0.0000102 -0.0195007 -0.024014 -0.0000098 -0.0000062 -0.0000183 -0.225777 0.0817444 0.0550853 -0.0000107 -0.0093241 -0.2401927 0.0000019 -0.0000147 -0.0000005 -0.2010586 -0.0925849 0.0013081 -0.0000009 0.0030046 0.0074906 -0.0000076 -0.0000052 -0.0000094 -0.17804 -0.0186542 -0.1337267 0.0000054 -0.0767346 -0.0904907 0.0000064 0.0000235 0.0000427 0.0675418 0.0051439 0.0230248 0. 0.0127112 0.0925545 -0.0000133 0.0000095 -0.0000114 -0.1668484 0.0315799 0.0861131 0.0000088 0.1323205 0.5654936 -0.000029 -0.0000182 -0.0000327 -0.1260552 0.1163854 -0.006993 -0.0000009 0.0413198 -0.0430017 0.00001 0.000001 0.0000134 0.1912636 -0.133555 -0.0275863 0.0000042 -0.0444218 0.0816017 0.000002 0.0000028 0.0000002 0.155768 0.0724712 -0.0682799 0.0000041 -0.0432612 -0.0407513 0.0000105 0.0000013 0.0000101 0.1845463 -0.0233253 0.1616313 0.0000308 0.0630908 -0.0342141 -0.0000187 0.0000149 -0.0000334 0.1042953 0.0158736 -0.0531863 -0.1111436 -0.0391765 0.0275512 -0.003044 -0.1252376 -0.0630099 -0.0391465 0.0159494 -0.053183 0.1111159 -0.0392083 0.0275279 0.0030726 0.1252163 0.0630315 -0.0392142 0.0027909 0.1109871 -0.0000036 0.0987265 -0.0491062 0.0000075 -0.0000055 0.0000109 0.161445 0.0000551 0.0311334 -0.0000066 0.0146505 0.0925258 0.0000051 0.0000065 0.0000028 0.2148669 unknown
polarizability: 127.5952247|-5.0062725|110.1401561|0.0000827|-0.0023391|44.587396 unknown
InChI: InChI=1S/C9H8O/c1-7-3-2-4-9-8(7)5-6-10-9/h2-6H,1H3
charge 0 multiplicity 1
18 atoms
O  -2.088194 -0.792106 0.000028
C  -0.182854 0.542443 -0.000035
C  1.221615 0.773287 -0.000051
C  -0.674598 -0.7983 0.000016
C  -1.361364 1.402097 -0.000046
C  2.054564 -0.371704 -0.00002
C  0.140268 -1.937808 0.000057
C  1.805615 2.174834 -0.000084
C  1.532664 -1.69495 0.000026
C  -2.46271 0.574172 -0.000061
H  -1.387553 2.489946 -0.000086
H  3.142932 -0.233743 -0.000034
H  -0.278142 -2.947764 0.000109
H  1.01881 2.947329 0.000078
H  2.441362 2.342651 0.889491
H  2.441076 2.342734 -0.889851
H  2.225015 -2.543855 0.000058
H  -3.533906 0.758636 -0.000094
