program: Gaussian 09
title: 000033103
version: EM64L-G09RevD.01
frameworkgroup: C1[X(C9H8O)]
method: RPBEPBE
basis: SDD
operation: Freq
keyword: #p
keyword: freq=noraman
keyword: PBEPBE/SDD
title: #p freq=noraman PBEPBE/SDD
converged: YES YES NO NO
title: Mulliken charges:
elementType: O C C C C C C C C C H H H H H H H H
charge: -0.237378 0.284156 0.165262 0.461956 -0.583555 -0.333383 -0.337017 -0.380118 -0.814684 -0.161890 0.249080 0.249358 0.232154 0.262221 0.229513 0.229693 0.224012 0.260621
chargesum: 0.00000
title: Mulliken charges with hydrogens summed into heavy atoms:
elementType: O C C C C C C C C C
charge: -0.237378 0.284156 0.165262 0.461956 -0.334475 -0.084026 -0.104863 -0.117897 -0.131466 0.098731
polarizability: 1.41719384e+02 5.46862185e+00 9.89697241e+01 3.91821539e-03 -4.05737506e-04 4.46416614e+01
1716.lowfreq: -0.0011 -0.0010 -0.0008 4.5179 9.8680 12.6426 54.0286 142.3064 223.3109
frequency: 53.9443 142.3060 223.3104 283.4184 331.1808 414.5772 423.3426 465.4340 565.1600 596.9776 604.5277 734.1756 739.1372 769.8548 770.2869 808.1860 858.7880 859.7192 891.2205 926.6744 948.7479 988.3410 1005.9806 1048.0325 1089.6658 1124.9437 1141.4122 1190.3799 1260.7178 1263.0401 1312.9238 1392.2500 1401.0648 1446.6106 1452.8008 1470.9499 1483.1836 1525.3828 1599.1982 1629.4711 2975.7645 3053.3242 3083.4587 3129.3908 3137.2379 3172.4086 3221.1855 3263.4507
redmass: 1.0547 3.5604 4.1280 2.9996 4.0187 4.0488 2.8417 4.9829 3.7872 5.9083 3.1888 6.0702 1.9768 1.8471 5.2083 1.3680 1.2965 6.7768 1.4621 2.6498 1.3325 2.5408 1.6884 1.5394 2.2048 1.5520 1.4748 1.7839 2.0023 2.0657 1.9019 3.5316 1.3665 4.1202 2.7253 1.0454 1.2429 4.5396 7.1656 7.5807 1.0373 1.0978 1.0986 1.0896 1.0924 1.0959 1.0924 1.1069
irintensity: 0.5372 1.9593 5.2824 1.6263 0.8158 7.1486 12.2635 0.0472 0.0681 0.0446 4.1950 1.5839 38.5781 34.5299 7.3198 47.6019 1.5883 6.9086 20.4322 0.2002 2.2720 18.2680 6.2659 13.0212 14.0523 27.2884 4.0480 21.7758 1.8118 2.5093 6.3190 0.6393 14.6128 9.9688 25.9809 12.9511 19.1716 4.7764 2.5536 4.1466 39.8558 22.7217 19.3755 13.0190 12.3905 6.9550 2.4761 0.8252
temp: 298.150 k
press: 1.00000 atm
elementType: 8 6 6 6 6 6 6 6 6 6 1 1 1 1 1 1 1 1
symmnumber: 1
zpe: 372478.5 jmol-1
zpe.correction: 0.141870 hartree
zpe.thermalcorrener: 0.149869 hartree
zpe.thermalcorrenthalpy: 0.150813 hartree
zpe.thermalcorrgfe: 0.108808 hartree
zpe.sumelectzpe: -422.268836 hartree
zpe.sumelectthermal: -422.260836 hartree
zpe.sumelectthermalent: -422.259892 hartree
zpe.sumelectthermalfe: -422.301897 hartree
dipole: 0.7538 -1.0340 0.0013
dipole: 1.2795
quadrupole: -50.0553 -52.7234 -62.6812
quadrupole: 3.8403 0.0021 -0.0011
quadrupole: 5.0980 2.4299 -7.5279 3.8403 0.0021 -0.0011
hfenergy: -422.4107055 hartree
pointgroup: C01 [X(C9H8O1)]
dipole: 0.2874066 0.4129789 -0.0164288 debye
dipolederiv: -0.6718152 0.1530341 -0.0085669 -0.1450352 -0.5968639 0.0184307 0.0036208 0.0197421 -0.1361286 0.172799 -0.006833 0.0007885 -0.2419418 -0.1112233 0.0057103 0.0106897 0.006701 0.0506614 0.4895863 -0.0298617 0.0033088 0.2865957 -0.026727 0.0031723 -0.009721 0.0018513 0.0195642 0.3387178 0.1030693 -0.0030017 0.1716648 -0.054694 0.0014043 -0.0070944 0.0008768 -0.0362542 -0.0918318 -0.0412139 0.0021333 0.0734185 0.107424 -0.0120606 -0.0025141 -0.0124977 -0.188447 0.0019293 -0.060904 0.0031356 -0.0362851 0.0772099 -0.0092697 0.0022213 -0.009356 -0.1402354 -0.1560213 -0.0114407 0.0005731 -0.1436559 0.0552879 -0.0112024 0.0062389 -0.0105825 -0.2030461 -0.141958 -0.1774627 0.0077652 -0.0441694 -0.0326699 -0.0087347 0.0022083 -0.0093624 -0.2378908 -0.1234832 -0.0410356 0.0010022 0.0101163 0.0805156 -0.0001308 0.000543 -0.0001556 0.0752049 -0.0038073 0.0171491 -0.0001707 0.0200682 0.5774845 -0.0288826 -0.0003595 -0.0289447 -0.1233124 0.0636489 -0.0429098 0.0013011 -0.0567206 -0.0877072 0.0100624 0.001883 0.0100597 0.1604867 0.0836373 -0.047764 0.0015632 -0.0258836 -0.0571927 0.009641 0.0006299 0.0095615 0.1774697 -0.0433748 0.1130682 -0.0055522 0.0949257 0.0089222 0.0064403 -0.004902 0.0065861 0.1551254 0.093027 0.0226576 -0.0013961 0.0712333 -0.0251356 0.0095429 -0.003414 0.0093591 0.1974753 -0.0362901 -0.0018679 -0.0763591 0.0228573 0.0718321 0.0831245 -0.1356201 0.0485783 -0.0523348 -0.0381194 0.0038913 0.0764189 0.0325528 0.0619956 -0.090927 0.1335403 -0.0568347 -0.0413042 0.0685189 0.0349215 -0.0014177 -0.0857235 -0.148523 0.0088951 0.0028193 0.0095551 0.1070497 -0.0051633 0.0135023 -0.0015258 -0.0040175 0.1000647 0.004784 -0.0007695 0.0048627 0.2159162 unknown
polarizability: 141.9402449|-4.4896002|98.6528076|0.5912755|-2.2577277|44.7377175 unknown
InChI: InChI=1S/C9H8O/c1-7-2-3-9-8(6-7)4-5-10-9/h2-6H,1H3
charge 0 multiplicity 1
18 atoms
O  -2.154218 -0.940923 0.03356
C  -0.512232 0.703842 -0.02722
C  -0.761694 -0.697184 0.029607
C  1.882819 0.214143 0.003101
C  0.832141 1.158193 -0.040328
C  0.251421 -1.665454 0.074004
C  1.577499 -1.183596 0.059762
C  -1.81858 1.34643 -0.059508
C  3.335777 0.66227 -0.009958
C  -2.760336 0.339257 -0.022035
H  1.058007 2.229563 -0.083742
H  0.023698 -2.734057 0.117328
H  2.404692 -1.902783 0.093179
H  -2.0260 2.413858 -0.104642
H  3.871931 0.316397 0.893865
H  3.875511 0.252492 -0.884544
H  3.420427 1.761873 -0.049366
H  -3.847165 0.33128 -0.026462
