program: Gaussian 09
title: 000033263
version: EM64L-G09RevD.01
frameworkgroup: C1[X(C22H29N3O)]
method: RPBEPBE
basis: SDD
operation: Freq
keyword: #p
keyword: freq=noraman
keyword: PBEPBE/SDD
title: #p freq=noraman PBEPBE/SDD
converged: YES YES NO NO
title: Mulliken charges:
elementType: O N N N C C C C C C C C C C C C C C C C C C C C C C H H H H H H H H H H H H H H H H H H H H H H H H H H H H H
charge: -0.368111 -0.283571 -0.076395 -0.045558 0.107169 0.130274 0.436857 0.603478 -0.382759 -0.363902 -0.642870 -0.773316 -0.710994 -0.716315 -0.778975 -0.174306 -0.624685 0.392757 -0.691192 -0.717552 0.051785 0.052852 -0.298343 -0.298711 -0.208946 -0.210029 0.183930 0.209925 0.196679 0.192813 0.248600 0.223981 0.221456 0.223828 0.214657 0.230274 0.217555 0.212884 0.224329 0.209007 0.219305 0.217400 0.230685 0.286409 0.217035 0.245625 0.213831 0.210530 0.220985 0.234775 0.338005 0.247785 0.248544 0.225214 0.225313
chargesum: 0.00000
title: Mulliken charges with hydrogens summed into heavy atoms:
elementType: O N N N C C C C C C C C C C C C C C C C C C C C C C
charge: -0.030106 -0.283571 -0.076395 -0.045558 0.107169 0.130274 0.436857 0.603478 0.011096 0.025590 -0.394271 -0.104051 -0.048508 -0.070094 -0.111585 -0.174306 -0.338276 0.392757 -0.014701 -0.051263 0.051785 0.052852 -0.050557 -0.050167 0.016269 0.015284
polarizability: 3.83262353e+02 -2.46138185e+00 2.69602276e+02 -3.90327986e-01 -1.18701097e+01 1.86774592e+02
1716.lowfreq: -10.1775 -8.7295 -0.0008 0.0004 0.0006 2.4279 18.7822 26.4707 28.5374
frequency: 18.7064 26.1470 28.4444 40.1521 46.7375 67.4055 79.0128 103.8937 118.7873 124.8510 164.6361 179.3940 190.5207 202.9076 210.3233 214.5643 217.6828 230.4062 243.8222 257.1951 262.8333 275.0988 279.0987 304.1813 309.0475 316.7060 324.0148 332.3915 338.4698 363.6327 373.8022 389.4031 404.4216 436.1533 447.2108 454.1659 475.5710 485.5490 497.4065 526.6757 555.4720 572.6866 593.2275 613.0468 629.0345 649.1928 662.9407 700.0992 727.1077 759.5734 765.6411 767.5567 768.5273 774.4843 789.9602 804.2206 846.6208 859.2002 877.7264 893.1302 901.5332 906.3006 918.7361 924.6625 931.2566 936.3062 938.2874 951.5396 983.0887 987.3465 987.7053 993.5536 1009.3018 1012.6685 1039.6310 1048.1923 1066.5190 1068.7801 1083.7898 1105.6238 1113.6178 1123.5719 1136.5819 1155.6834 1165.3323 1169.6284 1193.2943 1207.3612 1212.5403 1233.6131 1244.0843 1252.0200 1275.4657 1279.5610 1288.9042 1296.7103 1309.7168 1315.5372 1321.6645 1336.8740 1373.0959 1378.0009 1380.4100 1390.1555 1395.1128 1396.5465 1398.5100 1401.7942 1425.0280 1459.0856 1460.2549 1462.3043 1466.5912 1472.1275 1473.4204 1475.2393 1476.9545 1478.7417 1479.4944 1482.6622 1484.3903 1485.5677 1486.8617 1492.7272 1497.5575 1503.0232 1563.6986 1599.5793 1617.6000 1621.4854 2928.5705 2965.8888 2970.1144 2975.5411 2978.2476 2981.8179 2983.2647 2987.8789 3005.1336 3015.1130 3063.5556 3067.9853 3068.3045 3072.3521 3074.7435 3075.4265 3076.7858 3079.4440 3079.7475 3082.6110 3083.3773 3089.0442 3132.6750 3149.0228 3164.7224 3169.0795 3176.4186 3180.9945 3578.2450
redmass: 4.9374 3.3567 3.1148 4.4396 4.1275 3.3309 2.5095 3.9543 3.4588 1.9695 3.5658 2.0979 1.3414 1.8139 2.2230 1.3112 1.2184 1.4053 3.1678 5.2231 3.3560 2.4107 1.6693 2.0613 1.2977 2.8244 2.2968 2.3137 1.9238 2.4863 2.2587 4.0492 2.7490 2.9775 3.4112 3.2051 2.9314 4.1257 2.9459 3.0208 6.3415 3.6953 5.3779 6.5898 5.0119 3.9752 5.6706 5.3135 4.5574 1.3033 1.5628 3.1475 2.3612 2.1365 2.3421 2.0995 3.2848 1.5274 2.6577 3.7374 2.6143 1.8851 1.6353 4.6912 1.7260 1.6260 1.7694 1.3520 1.3027 1.2642 1.2844 2.1622 1.4960 1.5504 1.6280 1.5707 2.2442 2.0486 4.0251 4.9946 1.8597 1.4936 2.0552 1.1787 2.6191 2.7019 2.6575 2.2885 2.3621 2.0143 2.4241 2.0486 3.4604 1.5239 1.3918 2.1302 1.9581 1.5470 1.4669 3.5609 1.6999 2.2561 1.2730 1.2169 1.2304 1.4497 1.6324 1.2710 3.7918 1.2618 1.2448 1.1655 1.1326 3.3783 1.1821 1.1051 1.0547 3.1523 1.0628 1.0670 1.1766 1.1725 1.0685 1.1053 1.0610 1.0935 6.9888 6.3214 6.8222 7.3088 1.0689 1.0555 1.0375 1.0355 1.0362 1.0357 1.0368 1.0364 1.0897 1.1009 1.0998 1.0995 1.0996 1.0993 1.0995 1.0995 1.0996 1.0993 1.0991 1.0992 1.0994 1.0999 1.0859 1.0899 1.0884 1.0958 1.0995 1.0915 1.0655
irintensity: 0.0358 0.2970 0.0926 1.1264 0.3396 0.2623 0.1737 2.6909 2.0573 0.3882 1.0739 5.0369 3.1439 1.2818 4.0187 0.9803 2.0921 0.0678 0.5609 0.3928 11.8044 15.2167 43.0642 14.4620 1.3562 0.9800 1.1502 1.6067 1.7617 3.3505 8.9222 0.5350 3.2030 9.0520 1.7596 2.3432 2.2372 1.4220 1.2248 1.2227 2.2274 1.1102 7.7059 0.3845 3.1958 4.3295 2.1231 14.8621 1.5861 96.6995 6.9041 3.9333 11.7670 16.3812 12.5579 2.8844 19.3863 0.0694 2.5498 5.7743 8.6314 5.1087 3.1742 8.4107 10.0511 0.3823 3.9529 1.2988 0.0654 2.5188 1.9595 4.0271 16.7879 7.2915 3.6377 1.6996 1.5142 6.6454 13.0439 10.1617 73.7602 8.9371 9.9845 2.7123 9.8533 3.2962 3.2885 33.1518 8.8323 4.3227 1.8358 14.5094 6.5169 34.7601 44.8331 6.6303 7.5924 13.4652 3.4007 28.5679 38.3105 4.4996 16.1419 24.3786 17.0024 16.1785 9.6601 13.0683 15.4722 31.5891 26.5139 5.7958 7.6595 0.1210 15.2369 6.3733 15.1462 1.3087 11.5272 9.7993 49.2098 8.7555 13.3532 2.9321 10.9446 15.1627 4.3326 5.6640 0.1752 0.3997 58.7163 20.0251 57.4705 34.1890 27.1015 22.2105 26.1910 21.9830 44.3708 27.8299 24.0854 15.4705 41.3858 16.5270 23.4250 74.6739 26.7472 127.0947 22.1524 24.5938 33.0284 51.3290 4.5087 12.6170 11.0200 16.5615 29.8485 0.3990 104.9407
temp: 298.150 k
press: 1.00000 atm
elementType: 8 7 7 7 6 6 6 6 6 6 6 6 6 6 6 6 6 6 6 6 6 6 6 6 6 6 1 1 1 1 1 1 1 1 1 1 1 1 1 1 1 1 1 1 1 1 1 1 1 1 1 1 1 1 1
symmnumber: 1
zpe: 1212604.1 jmol-1
zpe.correction: 0.461857 hartree
zpe.thermalcorrener: 0.488359 hartree
zpe.thermalcorrenthalpy: 0.489303 hartree
zpe.thermalcorrgfe: 0.405058 hartree
zpe.sumelectzpe: -1093.248868 hartree
zpe.sumelectthermal: -1093.222365 hartree
zpe.sumelectthermalent: -1093.221421 hartree
zpe.sumelectthermalfe: -1093.305667 hartree
dipole: 3.2496 -1.0432 0.3123
dipole: 3.4272
quadrupole: -137.8196 -144.2311 -160.7582
quadrupole: -5.5682 -1.4161 0.6342
quadrupole: 9.7834 3.3718 -13.1552 -5.5682 -1.4161 0.6342
hfenergy: -1093.7107247 hartree
pointgroup: C01 [X(C22H29N3O1)]
dipole: -1.2838914 0.3975759 0.1079749 debye
polarizability: 383.1979123|-1.9513811|268.817571|4.2914897|14.2081707|187.6237375 unknown
InChI: InChI=1S/C22H29N3O/c1-7-21(3,4)15-13-16(22(5,6)8-2)20(26)19(14-15)25-23-17-11-9-10-12-18(17)24-25/h9-14,26H,7-8H2,1-6H3
charge 0 multiplicity 1
55 atoms
O  0.196243 2.315565 -0.550567
N  1.647126 0.015946 0.00155
N  2.367817 -0.952905 -0.679097
N  2.365514 0.9356 0.736979
C  -2.833927 2.371756 -0.495802
C  -2.574207 -2.673807 0.511932
C  -1.968878 1.111783 -0.214242
C  -1.828022 -1.345489 0.24701
C  -2.492666 3.564295 0.478454
C  -3.571323 -2.980209 -0.660467
C  -2.561909 -0.146214 0.042769
C  -4.351065 2.076068 -0.335406
C  -2.622096 2.832605 -1.975183
C  -3.399694 -2.536981 1.828412
C  -1.601123 -3.868211 0.685676
C  -0.538356 1.164515 -0.244325
C  -0.4231 -1.253939 0.218225
C  0.21138 -0.01447 -0.004611
C  -2.388968 3.195866 1.973212
C  -2.928754 -3.147512 -2.053913
C  3.673505 -0.615716 -0.368338
C  3.671891 0.545733 0.497042
C  4.894058 -1.227849 -0.772919
C  4.889826 1.10862 0.974274
C  6.081007 -0.660717 -0.294914
C  6.079114 0.492438 0.568737
H  -1.557991 4.087789 0.176717
H  -3.283971 4.327264 0.336337
H  -4.127886 -3.902554 -0.395047
H  -4.326607 -2.170086 -0.707126
H  -3.652754 -0.201232 0.076548
H  -4.611236 1.757078 0.689743
H  -4.691573 1.294804 -1.038332
H  -4.924526 2.993926 -0.559826
H  -3.184327 3.766081 -2.16708
H  -2.990693 2.059573 -2.672915
H  -1.561919 3.016411 -2.228124
H  -4.141899 -1.720538 1.762778
H  -2.737273 -2.324263 2.687306
H  -3.947762 -3.475512 2.036987
H  -2.180361 -4.798139 0.834814
H  -0.952518 -3.733604 1.570948
H  -0.951088 -4.014254 -0.194912
H  0.215424 -2.127015 0.368586
H  -2.214583 4.099532 2.585012
H  -1.557045 2.494491 2.159343
H  -3.317847 2.720347 2.336401
H  -3.706503 -3.301693 -2.824583
H  -2.250013 -4.018231 -2.091048
H  -2.345317 -2.252008 -2.334626
H  -0.387537 3.112542 -0.561563
H  4.894317 -2.102535 -1.429819
H  4.88515 1.985742 1.627788
H  7.042824 -1.100022 -0.582131
H  7.039423 0.892936 0.912131
