program: Gaussian 09
title: 000033107
version: EM64L-G09RevD.01
frameworkgroup: C1[X(C10H10O)]
method: RPBEPBE
basis: SDD
operation: Freq
keyword: #pfreq=noraman
keyword: PBEPBE/SDD
title: #p freq=noraman PBEPBE/SDD
converged: YES YES NO YES
title: Mulliken charges:
elementType: O C C C C C C C C C C H H H H H H H H H H
charge: -0.245152 0.122345 0.211807 0.299741 0.480558 -0.543267 -0.393915 -0.363353 -0.326795 -0.800815 -0.810014 0.253966 0.236914 0.225698 0.268719 0.233857 0.233885 0.230284 0.230241 0.225124 0.230172
chargesum: 0.00000
title: Mulliken charges with hydrogens summed into heavy atoms:
elementType: O C C C C C C C C C C
charge: -0.245152 0.122345 0.211807 0.299741 0.480558 -0.289302 -0.157001 -0.137656 -0.058076 -0.102789 -0.124476
polarizability: 1.57370127e+02 -6.27554147e+00 1.12560709e+02 1.82658732e-03 -6.01668702e-03 5.42403177e+01
1716.lowfreq: 0.0007 0.0009 0.0009 1.7476 7.3646 14.4842 53.9132 109.0662 137.9533
frequency: 53.8077 109.0439 137.9511 195.6775 207.6203 258.8916 312.2482 355.5565 429.4661 454.5110 463.7790 578.4043 582.6334 605.4398 642.6353 748.2980 753.0770 773.8223 775.6122 819.2901 875.5475 908.5170 954.3283 985.5836 1002.1805 1043.4363 1044.8357 1046.0972 1056.4340 1126.6711 1151.1816 1209.8297 1256.8920 1272.8499 1345.3353 1387.0043 1399.2992 1404.9370 1431.8387 1468.3852 1470.8361 1472.2570 1474.4704 1496.4931 1582.0881 1594.5104 1635.5347 2975.0573 2975.7295 3050.4134 3052.6090 3085.3566 3085.7463 3121.8507 3149.0195 3159.2112 3250.0577
redmass: 1.0550 3.0773 1.0606 2.9389 3.1635 3.8997 2.8237 4.5667 2.8023 4.8535 4.0275 5.1478 4.0985 3.0050 4.7539 6.2591 4.1706 1.3584 5.7913 1.3741 1.3683 3.2952 1.3275 1.7880 1.4334 3.9935 1.4822 1.5260 3.9092 2.0299 1.4410 1.7084 1.6619 1.9732 3.6332 3.4504 1.2466 1.2740 4.8006 1.0440 1.0460 1.3135 1.0951 2.3983 6.4668 6.1760 7.7213 1.0373 1.0374 1.0980 1.0976 1.0985 1.0982 1.0874 1.0964 1.0931 1.1000
irintensity: 0.5399 3.3583 0.0810 1.7713 0.6462 0.9037 0.4744 0.5032 11.9421 0.4734 1.5862 3.6135 6.9914 2.7306 3.4274 3.7037 0.7684 29.9967 3.6844 57.8494 8.3755 12.2502 0.9680 0.3291 12.7470 42.6205 10.4589 6.7862 7.9413 9.9344 7.8566 1.0006 3.7752 3.6117 9.7448 9.7195 11.9042 12.7052 4.4224 15.1492 13.1852 13.3510 24.8280 13.2132 2.6219 0.5081 13.5505 55.8605 22.9631 21.0058 23.1861 17.8261 23.3102 11.6982 22.9340 3.9655 0.4015
temp: 298.150 k
press: 1.00000 atm
elementType: 8 6 6 6 6 6 6 6 6 6 6 1 1 1 1 1 1 1 1 1 1
symmnumber: 1
zpe: 444174.6 jmol-1
zpe.correction: 0.169177 hartree
zpe.thermalcorrener: 0.178947 hartree
zpe.thermalcorrenthalpy: 0.179891 hartree
zpe.thermalcorrgfe: 0.133976 hartree
zpe.sumelectzpe: -461.499636 hartree
zpe.sumelectthermal: -461.489866 hartree
zpe.sumelectthermalent: -461.488922 hartree
zpe.sumelectthermalfe: -461.534837 hartree
dipole: 0.1959 1.3996 0.0016
dipole: 1.4133
quadrupole: -52.1343 -62.4215 -68.7115
quadrupole: 1.1493 0.0010 -0.0010
quadrupole: 8.9548 -1.3324 -7.6224 1.1493 0.0010 -0.0010
hfenergy: -461.6688127 hartree
pointgroup: C01 [X(C10H10O1)]
dipole: -0.0582837 -0.5526837 0.0177965 debye
dipolederiv: -0.7381531 -0.2135279 0.0044304 0.1598551 -0.6222205 0.0160459 -0.0072663 0.014677 -0.1332521 0.0881506 -0.2066146 0.0068071 0.0211504 -0.246042 0.007838 -0.0004575 0.0070472 -0.0008412 0.3114087 -0.0779558 0.0035255 -0.4730729 0.2640395 -0.0084375 0.0159678 -0.0069594 0.0515718 0.1657972 0.2199327 -0.006186 0.1207101 0.0199075 -0.0027559 -0.0032093 -0.0026271 -0.0769875 0.3511336 0.020415 0.0009387 0.0965004 0.0215657 -0.0017517 -0.0018158 -0.0020768 -0.045359 -0.1367803 0.0368101 -0.0010015 0.0998761 0.0141748 -0.0055868 -0.00298 -0.0058212 -0.1769219 0.0838462 -0.0012461 0.0009611 -0.0289686 0.1119281 -0.0086155 0.0019329 -0.0084564 -0.1569901 -0.2123366 -0.0577963 0.0017374 -0.2083408 0.0561789 -0.0087256 0.0064815 -0.0081565 -0.197206 0.1272673 0.2693612 -0.0073793 0.2120838 0.3611262 -0.0157252 -0.0054243 -0.0156039 -0.1646101 0.0257347 -0.0371459 0.0010139 -0.0349272 0.0164935 0.0022661 0.0010647 0.0024555 0.0893172 -0.1375731 -0.0107863 -0.000499 0.0674726 0.0780099 0.0001648 -0.0023313 -0.0001643 0.0742217 0.0573414 -0.0631268 0.0014918 -0.0742072 -0.0379865 0.0063349 0.0017887 0.0063221 0.17365 0.0542771 -0.0865723 0.0023189 -0.0593481 -0.0745656 0.0069803 0.0014764 0.0068959 0.1550407 -0.0205277 0.1158553 -0.0043276 0.1100561 -0.0343405 0.0063501 -0.0042402 0.0064355 0.1547516 0.0021465 0.0373305 -0.0019391 0.036991 0.0739105 0.0044994 -0.0019699 0.0045204 0.212119 0.073206 0.0025295 0.0472016 -0.0567538 -0.023404 -0.1051301 -0.0124343 -0.1279238 -0.0375095 0.073379 -0.0014375 -0.0464162 -0.0565615 -0.0085496 0.1027661 0.0168655 0.1259889 -0.0526501 -0.1417139 0.0230853 -0.0016944 0.1165199 0.0443078 0.0026989 -0.0046269 0.002337 0.1152346 -0.0387747 0.0185805 0.0592694 0.041615 0.0546426 -0.1021314 0.1243327 -0.0777279 -0.0400207 0.0491448 -0.0021103 -0.0002007 -0.1241763 -0.1339202 0.0065895 0.0033401 0.0071714 0.1081303 -0.0369735 0.0144199 -0.0600519 0.0335259 0.0647439 0.0963258 -0.1264945 0.0716661 -0.0516886 unknown
polarizability: 157.7439417|-4.7213066|112.1273742|0.5329563|-1.8338355|54.2998375 unknown
InChI: InChI=1S/C10H10O/c1-7-3-4-9-8(2)6-11-10(9)5-7/h3-6H,1-2H3
charge 0 multiplicity 1
21 atoms
O  -1.067928 1.834657 -0.07057
C  -0.618706 -0.439887 0.002439
C  -0.045795 0.862026 -0.03625
C  -2.070027 -0.264296 -0.008222
C  2.199728 -0.003306 -0.000292
C  1.333394 1.11643 -0.038752
C  0.255694 -1.555924 0.040708
C  1.644979 -1.322352 0.038732
C  -2.28471 1.098454 -0.051762
C  -3.106718 -1.354495 0.023163
C  3.708222 0.182849 0.000057
H  1.722427 2.138701 -0.06907
H  -0.136253 -2.578416 0.071306
H  2.333329 -2.176012 0.068272
H  -3.186995 1.704296 -0.074115
H  -3.001424 -2.031512 -0.845665
H  -3.007597 -1.973901 0.934656
H  -4.129889 -0.942051 0.006251
H  4.173864 -0.310865 -0.873796
H  3.985986 1.250322 -0.030066
H  4.166919 -0.258816 0.904874
