program: Gaussian 09
title: 000033100
version: EM64L-G09RevD.01
frameworkgroup: C1[X(C12H8Cl2)]
method: RPBEPBE
basis: SDD
operation: Freq
keyword: #pfreq=noraman
keyword: PBEPBE/SDD
title: #p freq=noraman PBEPBE/SDD
converged: YES YES NO NO
title: Mulliken charges:
elementType: Cl Cl C C C C C C C C C C C C H H H H H H H H
charge: -0.048933 -0.066517 0.359410 0.434399 -0.370780 -0.388720 -0.330269 -0.375843 -0.091614 -0.205307 -0.227709 -0.237897 -0.242889 -0.225202 0.275131 0.261603 0.255642 0.234715 0.257764 0.235443 0.259165 0.238407
chargesum: 0.00000
title: Mulliken charges with hydrogens summed into heavy atoms:
elementType: Cl Cl C C C C C C C C C C C C
charge: -0.048933 -0.066517 0.359410 0.434399 -0.095648 -0.127117 -0.330269 -0.120201 -0.091614 0.029408 0.030055 -0.002454 0.016276 0.013205
polarizability: 2.07518421e+02 -1.17982622e+01 1.54429451e+02 -8.87166710e-01 4.86195209e+00 7.60047994e+01
1716.lowfreq: -7.1358 0.0014 0.0020 0.0027 3.1087 8.8073 37.2669 73.1734 91.5091
frequency: 37.1829 73.1685 91.5052 149.9000 172.8911 208.6758 250.6568 286.1443 324.1545 372.6872 403.6665 410.9150 449.3661 461.6002 536.3887 582.6003 609.1698 657.6798 678.0945 695.4603 728.6529 760.8005 785.0461 793.0642 865.2055 891.9745 911.9954 950.3780 980.8121 982.7151 986.5118 1003.0820 1025.3417 1062.7022 1079.5466 1094.9993 1124.7618 1174.0336 1182.3262 1250.1545 1272.9053 1303.6048 1354.6269 1367.5893 1409.4772 1423.3630 1451.9121 1483.6495 1561.4565 1572.1959 1603.3060 1607.2883 3134.7600 3143.7478 3146.6504 3161.5260 3162.6296 3168.3538 3176.3877 3179.0449
redmass: 9.6039 5.0506 5.9890 6.1779 7.2167 6.2215 5.4010 7.1801 4.9747 7.6648 5.6223 6.5534 3.4541 3.7405 4.2214 4.6134 7.1165 6.7042 7.5962 2.4293 3.5485 1.2538 5.5994 1.4734 1.3563 1.4486 1.3681 1.3796 1.3610 5.6627 1.3505 6.1867 4.9045 2.2232 1.7854 1.6838 1.6282 1.0605 1.0908 1.6124 1.5291 1.6634 4.8053 9.0450 3.0340 2.2763 2.2350 3.0998 5.8450 6.6511 7.0187 6.8340 1.0862 1.0874 1.0903 1.0937 1.0938 1.0928 1.1001 1.0989
irintensity: 0.4634 0.9364 1.1085 0.2089 0.1702 0.3635 0.8515 0.8669 0.1203 4.7376 3.8650 3.8514 4.4826 9.1919 0.5624 1.4553 5.8584 8.5267 40.0959 22.4374 2.7730 116.7973 18.8725 30.3794 0.8460 11.8850 0.2794 0.9778 0.2517 4.7531 0.1567 14.6183 32.3285 25.7204 8.0901 9.2603 4.2893 0.4202 0.1144 4.4971 11.2064 2.1883 7.9836 0.5645 28.4651 7.6988 57.8890 10.7875 18.7974 40.7295 2.3136 21.9185 1.9454 8.2039 9.1028 4.7890 8.8463 3.8183 14.8351 6.4355
temp: 298.150 k
press: 1.00000 atm
elementType: 17 17 6 6 6 6 6 6 6 6 6 6 6 6 1 1 1 1 1 1 1 1
symmnumber: 1
zpe: 417320.2 jmol-1
zpe.correction: 0.158949 hartree
zpe.thermalcorrener: 0.170632 hartree
zpe.thermalcorrenthalpy: 0.171576 hartree
zpe.thermalcorrgfe: 0.119719 hartree
zpe.sumelectzpe: -1381.237827 hartree
zpe.sumelectthermal: -1381.226144 hartree
zpe.sumelectthermalent: -1381.225200 hartree
zpe.sumelectthermalfe: -1381.277057 hartree
dipole: 1.8835 -0.6552 1.4421
dipole: 2.4610
quadrupole: -89.3481 -87.8260 -97.7609
quadrupole: -9.8328 -2.7574 2.1589
quadrupole: 2.2969 3.8190 -6.1159 -9.8328 -2.7574 2.1589
hfenergy: -1381.3967763 hartree
pointgroup: C01 [X(C12H8Cl2)]
dipole: 0.7861638 0.3628652 -0.4332726 debye
dipolederiv: -0.1883418 -0.159557 -0.0282332 -0.1234211 -0.6697481 -0.1311282 -0.0474978 -0.1337349 -0.0886787 -0.4644675 0.1632528 0.2697699 0.2174755 -0.1945097 -0.2052629 0.3726674 -0.2071651 -0.4390733 0.32591 -0.0298398 0.0146819 0.0273358 -0.0018476 0.0594335 -0.0076311 0.0206862 0.0870893 0.2759515 -0.0717128 0.0146037 -0.0054834 -0.2343719 -0.0825106 0.0780186 -0.0635536 -0.019853 -0.313494 0.0761196 0.1333725 0.0279008 -0.1309838 -0.0397711 0.1455707 -0.0349152 -0.1352845 -0.1909321 -0.0286899 -0.0816408 -0.0330641 -0.0834853 0.0621352 -0.0720013 0.0271918 -0.0546477 0.1201664 0.3023279 0.0633729 0.159073 0.9523065 0.203296 0.011902 0.2347924 -0.0269745 -0.1043204 0.0100153 0.0209045 -0.0588165 0.0364774 0.0167578 0.0280252 0.0348136 -0.126059 0.605394 -0.2658249 -0.438372 -0.3186005 0.1598152 0.3685739 -0.6165196 0.3749805 0.5979136 0.0980862 0.0000302 0.0215731 0.0010338 -0.0776916 0.1082993 0.067589 0.1058323 0.069305 -0.1135754 -0.145534 -0.0268259 -0.1297606 -0.1832923 -0.0217048 -0.0140545 -0.0323388 -0.1054952 -0.0743675 0.0550622 0.0234688 0.0813169 0.0642536 0.0631263 -0.0041998 0.0552001 -0.1354156 -0.1517509 0.0575147 0.0946084 0.0774354 -0.1569107 -0.0622259 0.1477444 -0.0608548 -0.2295314 0.054213 -0.020984 0.0202136 0.018296 0.0187856 0.0429323 0.0261817 0.0370803 -0.1410384 0.0945573 -0.0297725 -0.0529032 -0.0282918 0.1198103 -0.0626806 -0.0655632 -0.0502019 0.0300207 0.0453274 0.0372393 0.0785593 0.0329561 0.1051556 -0.0658827 0.0835477 -0.0488302 0.0446712 0.0349098 0.0888343 0.0040745 0.0974201 -0.0084321 -0.0168302 0.0044988 -0.0293226 0.1337003 0.0288516 -0.0174228 -0.0523912 -0.0308855 0.1056957 -0.0980717 -0.0680977 -0.0926625 -0.0337968 0.0367833 0.0578715 0.001016 0.0811411 0.007116 -0.027939 0.0069126 -0.0271132 0.1563592 0.0419392 -0.0571133 -0.0253861 -0.0831949 -0.0634769 -0.0621684 -0.033444 -0.0580271 0.1454966 -0.0501829 0.001138 -0.0200182 0.0096167 0.1548621 -0.0279437 -0.0109089 -0.0261483 0.1179338 -0.1106572 -0.0229548 -0.0344486 -0.0194828 0.080472 -0.0204344 -0.0327401 -0.0257089 0.1533586 unknown
polarizability: 209.8992888|-3.5529846|125.5096506|1.4541937|36.4777442|102.5437322 unknown
InChI: InChI=1S/C12H8Cl2/c13-10-5-3-4-9(8-10)11-6-1-2-7-12(11)14/h1-8H
charge 0 multiplicity 1
22 atoms
Cl 1.276485 -2.619725 -0.657532
Cl -3.847789 1.325158 1.760198
C  -0.509812 0.058869 -0.291924
C  0.968437 0.146951 -0.095393
C  -1.371064 0.630724 0.683862
C  -1.083342 -0.530468 -1.450226
C  1.874109 -0.934929 -0.255887
C  1.539714 1.396665 0.284249
C  -2.76209 0.594511 0.484835
C  -2.482929 -0.549833 -1.626446
C  3.263495 -0.797395 -0.065426
C  2.925816 1.558263 0.481422
C  -3.345067 0.013033 -0.656207
C  3.794812 0.458257 0.302049
H  -0.95788 1.071452 1.596061
H  -0.43373 -0.960771 -2.217325
H  0.870364 2.256755 0.396405
H  -2.912602 -1.001687 -2.526618
H  3.915978 -1.665791 -0.193229
H  3.324944 2.537445 0.765243
H  -4.430945 -0.000869 -0.785301
H  4.874296 0.567584 0.448788
