program: Gaussian 09
title: 000033132
version: EM64L-G09RevD.01
frameworkgroup: C1[X(C12H18N2O4)]
method: RPBEPBE
basis: SDD
operation: Freq
keyword: #p
keyword: freq=noraman
keyword: PBEPBE/SDD
title: #p freq=noraman PBEPBE/SDD
converged: YES YES NO NO
title: Mulliken charges:
elementType: O O O O N N C C C C C C C C C C C C H H H H H H H H H H H H H H H H H H
charge: -0.290445 -0.178954 -0.216359 -0.221058 -0.380248 -0.374957 0.062903 0.000467 -0.524242 0.153818 0.141246 -0.734994 -0.009512 -0.223918 0.151720 -0.379078 -0.598729 -0.679045 0.240042 0.278506 0.222028 0.226197 0.218199 0.255707 0.365855 0.364522 0.244475 0.193963 0.186914 0.218199 0.189794 0.220200 0.227065 0.237920 0.216065 0.195733
chargesum: 0.00000
title: Mulliken charges with hydrogens summed into heavy atoms:
elementType: O O O O N N C C C C C C C C C C C C
charge: -0.290445 -0.178954 -0.216359 -0.221058 -0.014393 -0.010435 0.062903 0.240508 -0.023708 0.153818 0.141246 -0.034891 0.234963 0.156960 0.151720 0.028915 -0.151464 -0.029326
polarizability: 2.03057213e+02 -7.81601927e+00 1.40558053e+02 -4.76642295e-01 8.80645929e+00 1.25249631e+02
1716.lowfreq: -10.9699 -6.8309 -0.0008 -0.0006 0.0004 5.4527 20.5470 43.3587 49.6259
frequency: 20.4906 43.2602 49.6045 65.6800 80.2851 90.4709 124.5685 129.5751 133.3596 149.4580 167.1421 189.4738 201.1649 211.0291 223.5587 250.0927 266.0816 293.4645 317.0863 355.8787 369.4534 382.6282 422.3246 475.6589 486.4214 493.8970 507.3339 584.9978 625.8366 639.1380 653.3576 685.4277 712.2704 743.6834 751.4201 761.0727 785.4445 841.4825 867.1445 887.4244 911.7828 913.1278 946.6978 958.5695 961.4063 988.1866 995.7827 996.9960 1013.0549 1079.4694 1083.1631 1104.6638 1115.2192 1123.4622 1140.4657 1152.2826 1188.9671 1223.5388 1245.5440 1277.6429 1290.7511 1303.0497 1315.1711 1321.9775 1335.9137 1353.5571 1365.2481 1373.7185 1377.0052 1378.7280 1383.5599 1393.2010 1425.1262 1450.8495 1454.4630 1462.6344 1471.6151 1480.7755 1486.8425 1490.1688 1613.1214 1651.3014 1657.6446 1677.0981 2926.8693 2974.4432 2975.6015 2978.6193 2979.1524 2990.0751 2993.9598 3043.8624 3073.2075 3076.9863 3079.0349 3091.0614 3092.9190 3104.6965 3112.4884 3200.9218 3518.6386 3521.8136
redmass: 8.8811 3.3674 2.8122 3.3418 3.1584 3.5002 3.2791 4.0493 4.7176 6.1958 2.3647 2.9120 2.7471 1.2146 2.7723 2.0689 3.0420 2.6543 2.5841 10.3240 6.9999 2.5905 2.6735 4.5457 3.2105 3.3702 5.3203 3.0864 2.4439 4.4917 2.6383 2.6333 4.2733 2.0675 1.5378 2.2738 1.7939 2.1190 1.9077 2.3519 2.7153 1.3519 2.1798 1.3754 2.1083 2.7523 2.2163 1.7012 2.1060 3.0304 2.1658 2.2027 2.4628 2.1479 1.8983 2.4816 5.0811 1.2143 1.3976 1.1741 1.6260 1.7062 1.4334 1.2860 1.3110 1.4641 8.5051 1.7625 1.6678 1.3152 1.2167 1.2701 1.1604 1.1157 1.0805 1.0544 1.0568 1.0566 1.0605 1.0543 7.0510 7.2668 5.1629 5.5629 1.0550 1.0666 1.0862 1.0725 1.0511 1.0386 1.0728 1.0989 1.0991 1.0947 1.0980 1.0613 1.0994 1.1004 1.0937 1.1148 1.0763 1.0776
irintensity: 0.7364 0.1827 0.8676 0.0238 0.2419 0.1603 3.3102 1.5659 0.8985 6.2642 3.4869 0.6097 2.9177 1.5878 2.5732 1.8831 0.5581 3.6225 1.4199 25.9447 6.3297 0.0747 2.6910 9.1257 7.8419 9.4707 40.9436 3.9997 1.4162 6.6083 2.0543 33.0261 10.9748 17.9518 4.5609 15.7747 175.4271 10.4479 4.6607 4.4720 11.3183 4.7796 40.8787 80.8680 28.5105 26.2876 12.5907 24.2294 16.6531 85.5687 61.4521 21.0088 10.3851 7.0712 0.9280 1.9473 48.6849 0.7328 59.3012 1.5695 125.1244 143.7122 38.6239 59.4565 9.8700 0.3861 223.7803 8.7069 6.1306 13.1941 18.2920 16.4897 4.0267 17.4865 9.7126 7.9979 6.2209 6.4871 14.8771 24.8073 282.8879 89.8290 20.8152 643.3400 49.3469 23.5141 16.1484 16.8553 35.5252 12.1357 72.3397 14.2393 65.2276 0.4129 31.9223 3.6981 50.7700 12.0314 6.4315 18.9254 76.9546 57.7366
temp: 298.150 k
press: 1.00000 atm
elementType: 8 8 8 8 7 7 6 6 6 6 6 6 6 6 6 6 6 6 1 1 1 1 1 1 1 1 1 1 1 1 1 1 1 1 1 1
symmnumber: 1
zpe: 763851.7 jmol-1
zpe.correction: 0.290936 hartree
zpe.thermalcorrener: 0.310333 hartree
zpe.thermalcorrenthalpy: 0.311277 hartree
zpe.thermalcorrgfe: 0.242382 hartree
zpe.sumelectzpe: -877.096300 hartree
zpe.sumelectthermal: -877.076903 hartree
zpe.sumelectthermalent: -877.075959 hartree
zpe.sumelectthermalfe: -877.144854 hartree
dipole: -1.6152 1.1138 0.6440
dipole: 2.0650
quadrupole: -111.7561 -110.6376 -109.1851
quadrupole: -1.7879 -0.3622 -4.6405
quadrupole: -1.2299 -0.1113 1.3412 -1.7879 -0.3622 -4.6405
hfenergy: -877.3872358 hartree
pointgroup: C01 [X(C12H18N2O4)]
dipole: -0.620513 0.4605473 0.2508173 debye
polarizability: 202.4043343|-10.1212944|141.1744277|0.2607217|8.7932894|125.2861349 unknown
InChI: InChI=1S/C12H18N2O4/c1-4-6-12(8(3)18-7-5-2)9(15)13-11(17)14-10(12)16/h4,8,13-14H,1,5-7H2,2-3H3
charge 0 multiplicity 1
36 atoms
O  -1.919413 -0.585896 0.257172
O  0.216603 -2.179026 -1.032043
O  1.34062 1.515805 1.858934
O  4.557627 -0.561556 -0.760467
N  2.338128 -1.283378 -0.936516
N  2.891016 0.522868 0.47104
C  0.460628 0.011702 0.10681
C  -0.739528 -0.272506 1.07178
C  0.009296 1.009652 -1.055813
C  0.954604 -1.250266 -0.627935
C  1.568317 0.722806 0.907465
C  -0.444826 -1.400913 2.079376
C  -0.485894 2.355765 -0.570886
C  -3.187524 -0.208693 0.909083
C  3.34838 -0.444407 -0.44347
C  -4.335371 -0.770994 0.062037
C  -1.703484 2.865792 -0.881396
C  -4.39561 -0.182537 -1.362947
H  -0.909876 0.677796 1.619822
H  -0.788816 0.484276 -1.606475
H  0.873131 1.153565 -1.737144
H  0.443131 -1.164381 2.694515
H  -1.297375 -1.523948 2.770044
H  -0.290104 -2.358987 1.556035
H  2.651755 -2.051618 -1.539049
H  3.61813 1.087929 0.921897
H  0.207119 2.953138 0.03808
H  -3.24456 0.900197 0.983874
H  -3.231113 -0.632998 1.935463
H  -4.219321 -1.869913 0.007723
H  -5.285574 -0.569039 0.596259
H  -2.005259 3.86553 -0.548744
H  -2.427741 2.299369 -1.478884
H  -3.452666 -0.383519 -1.900205
H  -5.223886 -0.63019 -1.941339
H  -4.555544 0.912475 -1.335196
