program: Gaussian 09
title: 000033325
version: EM64L-G09RevD.01
frameworkgroup: C1[X(C17H25NO2S)]
method: RPBEPBE
basis: SDD
operation: Freq
keyword: #p
keyword: freq=noraman
keyword: PBEPBE/SDD
title: #p freq=noraman PBEPBE/SDD
converged: YES YES NO NO
title: Mulliken charges:
elementType: S O O N C C C C C C C C C C C C C C C C C H H H H H H H H H H H H H H H H H H H H H H H H H
charge: 0.190875 -0.263815 -0.223812 -0.075163 -0.502704 -0.321588 0.407942 0.443313 -0.418779 -0.360017 -0.682113 -0.659895 0.300257 -0.384918 -0.413274 -0.358579 -0.252297 -0.252523 -0.616689 -0.628106 -0.500866 0.190071 0.252653 0.229183 0.221309 0.206702 0.244540 0.228244 0.204851 0.224635 0.271402 0.240568 0.238825 0.168958 0.211378 0.228081 0.227124 0.225281 0.183334 0.220492 0.238607 0.217151 0.182106 0.232382 0.243887 0.240985
chargesum: 0.00000
title: Mulliken charges with hydrogens summed into heavy atoms:
elementType: S O O N C C C C C C C C C C C C C C C C C
charge: 0.190875 -0.263815 -0.223812 -0.075163 -0.502704 -0.321588 0.407942 0.443313 0.023946 0.090476 -0.002627 0.040994 0.300257 -0.144350 -0.174449 0.021757 -0.024216 -0.025399 0.012417 0.009758 0.216389
polarizability: 2.02187258e+02 -1.67791469e+01 2.27465594e+02 -1.00641071e+01 -3.14035218e+00 1.99538761e+02
1716.lowfreq: -26.3748 -8.0233 -0.0010 0.0007 0.0013 6.1143 11.7277 30.1592 34.1926
frequency: -25.3943 29.8619 34.0277 44.9135 62.4630 69.7430 100.7304 105.2106 110.1919 120.2279 129.3937 157.4088 186.4648 198.1452 223.6851 229.0302 233.6610 242.0805 247.0093 256.5864 262.5818 278.5153 294.1404 309.2617 327.7819 345.7133 356.6359 364.5699 402.5070 414.5432 431.2094 480.3380 489.0552 511.6905 551.0229 578.9344 607.6275 630.2487 678.4376 712.7816 735.7896 756.2850 761.8264 768.7820 794.6161 816.6850 853.8322 882.8293 883.7193 916.8559 940.8529 949.5851 974.5786 987.2217 1005.2146 1016.5117 1032.1898 1034.3769 1038.5297 1067.8948 1072.2912 1085.6204 1092.0801 1104.0421 1112.3018 1114.2895 1134.6365 1144.7987 1148.6468 1156.7002 1167.1898 1169.6912 1175.5049 1215.5638 1224.9258 1258.8692 1267.0600 1279.9744 1288.0652 1292.7551 1297.7908 1348.6080 1376.0135 1379.1731 1380.6697 1397.8710 1418.4281 1420.2905 1435.1701 1442.2284 1452.3173 1456.7427 1459.7896 1460.4662 1461.5303 1462.9606 1463.9156 1472.9634 1474.0432 1477.2125 1477.5985 1482.3799 1484.5094 1488.8375 1593.0170 1606.7085 1618.0503 2801.7352 2834.1664 2851.4755 2967.2001 2973.1733 2979.2779 2996.0733 3004.1342 3004.5903 3015.8949 3029.6620 3050.1913 3066.2520 3071.7760 3072.3832 3075.5668 3088.8873 3098.3482 3103.9588 3106.7909 3121.9529 3128.1217 3142.6426 3148.0709 3162.2250
redmass: 2.4733 4.0329 4.0638 5.1369 4.4616 4.1962 2.5366 2.1644 2.0937 1.5740 2.7854 3.1673 3.9539 3.8216 2.3575 1.3843 1.1170 2.1276 1.4403 1.6789 2.8614 1.5045 3.3331 2.8344 2.4989 3.4387 3.4847 3.9374 9.0529 5.8030 2.4982 3.4569 3.1773 3.9051 3.4819 4.5366 4.6194 5.0515 5.9623 4.4967 1.9919 2.8900 1.7740 1.7429 2.2960 4.2514 2.9458 1.8076 1.6820 2.4815 1.5771 1.4328 7.0108 1.3255 1.2880 2.9636 2.3581 1.5680 3.9394 3.4582 1.9862 1.8510 1.4782 1.9346 1.8625 1.3005 1.4449 1.8962 1.6065 2.2557 2.2510 3.2605 1.0810 1.7108 2.9097 2.0061 2.2291 1.8428 1.3075 1.3873 1.3670 1.4330 1.4217 9.8475 1.1893 1.1955 1.1446 1.1789 2.2216 1.1646 1.0500 1.0526 1.0650 1.0608 1.0733 1.0624 1.0526 1.2440 1.0736 1.2369 1.0594 1.0786 1.4579 1.0791 7.5822 6.5099 9.9961 1.0704 1.0580 1.0579 1.0668 1.0372 1.0365 1.0749 1.0300 1.0696 1.0709 1.0714 1.0936 1.0974 1.0982 1.1007 1.1009 1.0999 1.1006 1.1007 1.1045 1.0853 1.0890 1.0941 1.1049 1.1005
irintensity: 0.4515 0.0771 0.2977 2.3215 0.0586 0.5351 1.5757 0.9267 0.3480 0.0675 0.3569 0.2328 1.4583 5.9533 1.1478 1.4760 0.4121 1.4605 0.5677 1.0247 6.7183 0.4488 4.8937 1.8946 8.0401 5.2371 2.1358 2.0988 0.1916 1.0987 0.4141 2.5152 14.0190 1.5629 9.4624 7.5785 8.8294 4.1199 23.1618 2.4919 4.5992 7.9552 17.5432 42.5053 8.1398 20.7836 8.0071 1.6050 2.9856 2.4238 0.8382 3.1765 47.4030 0.0288 1.0135 12.0151 5.9212 14.7116 18.9427 51.5877 8.2240 2.9519 18.5777 12.1454 26.6922 2.1901 17.7880 112.5238 14.5186 90.3126 96.6322 24.3369 1.2621 23.2102 8.5320 5.9387 13.2092 3.8451 3.4385 15.2598 1.8514 3.4123 16.9325 1.7926 26.8860 13.2048 1.5378 16.4082 8.4948 3.2317 13.6225 5.9354 7.2048 0.6484 9.8877 28.7631 4.8123 4.9746 5.7136 6.3603 11.0988 12.1188 29.3898 17.2083 1.5503 6.1638 139.4217 72.4480 72.3679 224.9703 23.8569 21.3306 41.7938 4.0357 49.7141 28.3517 47.5985 41.3683 1.1576 1.2971 15.9110 46.4270 48.9529 46.3112 16.0101 17.6549 22.9745 4.2269 4.0136 27.8285 16.0777 28.5814
temp: 298.150 k
press: 1.00000 atm
elementType: 16 8 8 7 6 6 6 6 6 6 6 6 6 6 6 6 6 6 6 6 6 1 1 1 1 1 1 1 1 1 1 1 1 1 1 1 1 1 1 1 1 1 1 1 1 1
symmnumber: 1
zpe: 1009142.5 jmol-1
zpe.correction: 0.384362 hartree
zpe.thermalcorrener: 0.407066 hartree
zpe.thermalcorrenthalpy: 0.408010 hartree
zpe.thermalcorrgfe: 0.332507 hartree
zpe.sumelectzpe: -1264.441826 hartree
zpe.sumelectthermal: -1264.419122 hartree
zpe.sumelectthermalent: -1264.418178 hartree
zpe.sumelectthermalfe: -1264.493682 hartree
dipole: -0.7580 -0.2105 1.1291
dipole: 1.3761
quadrupole: -134.8522 -116.2898 -133.2700
quadrupole: -2.5084 -8.7170 1.6388
quadrupole: -6.7149 11.8476 -5.1327 -2.5084 -8.7170 1.6388
hfenergy: -1264.8261884 hartree
pointgroup: C01 [X(C17H25N1O2S1)]
dipole: -0.2159481 -0.0590717 0.4929411 debye
polarizability: 195.2490082|-13.8867315|230.5773831|-9.7062233|0.9365377|203.365222 unknown
InChI: InChI=1S/C17H25NO2S/c1-16(2)13-9-6-7-10-14(13)17(21-16,15(19)20-5)11-8-12-18(3)4/h6-7,9-10H,8,11-12H2,1-5H3
charge 0 multiplicity 1
46 atoms
S  0.532294 0.463837 -2.089026
O  1.2991 3.064267 -0.120947
O  2.862306 1.401424 0.321969
N  -4.599483 0.368419 0.183068
C  0.501811 0.772567 -0.178524
C  1.357372 -1.281187 -1.9271
C  0.801599 -0.594393 0.432734
C  1.202166 -1.626679 -0.446236
C  -0.860986 1.378793 0.246722
C  -2.078011 0.462242 0.002284
C  0.59445 -2.24324 -2.863134
C  2.853454 -1.171514 -2.312239
C  1.684725 1.732647 0.052843
C  0.701876 -0.841965 1.820964
C  1.49672 -2.911033 0.069488
C  -3.366791 1.102213 0.557977
C  0.992242 -2.124794 2.332901
C  1.387493 -3.161678 1.454717
C  -5.81379 1.148925 0.495929
C  -4.666634 -0.992216 0.753217
C  2.39781 4.056687 -0.046781
H  -0.793597 1.627965 1.327406
H  -0.995256 2.340572 -0.279156
H  -2.204149 0.285552 -1.081424
H  -1.899054 -0.520468 0.476592
H  1.041733 -3.254844 -2.820255
H  -0.468191 -2.315635 -2.577227
H  0.653613 -1.897275 -3.910772
H  3.341523 -2.161789 -2.221292
H  2.962177 -0.826869 -3.355885
H  3.375335 -0.463706 -1.646994
H  0.401864 -0.037436 2.502148
H  1.809896 -3.7157 -0.605517
H  -3.27552 1.206877 1.674631
H  -3.458416 2.128297 0.149235
H  0.913819 -2.316861 3.408592
H  1.611604 -4.158755 1.849883
H  -5.769312 2.127361 -0.015426
H  -5.953187 1.338374 1.592276
H  -6.707086 0.612102 0.128675
H  -3.82292 -1.603036 0.391628
H  -5.601158 -1.481081 0.424412
H  -4.646879 -1.000581 1.874628
H  1.910825 5.026931 -0.218068
H  3.15098 3.845427 -0.824421
H  2.880735 4.020156 0.944106
