program: Gaussian 09
title: 000033177
version: EM64L-G09RevD.01
frameworkgroup: C1[X(C19H16FNO4)]
method: RPBEPBE
basis: SDD
operation: Freq
keyword: #p
keyword: freq=noraman
keyword: PBEPBE/SDD
title: #p freq=noraman PBEPBE/SDD
converged: YES YES NO NO
title: Mulliken charges:
elementType: F O O O O N C C C C C C C C C C C C C C C C C C C H H H H H H H H H H H H H H H H
charge: -0.202463 -0.262263 -0.253939 -0.412390 -0.199194 -0.223007 0.263679 0.132022 0.237336 0.086823 -0.511847 -0.532392 -0.324094 -0.806218 -0.028555 0.327116 -0.389209 0.304998 0.201010 -0.334441 -0.343870 -0.383834 -0.376076 0.319862 -0.536203 0.286639 0.278220 0.247635 0.257093 0.232231 0.306405 0.237319 0.252202 0.281609 0.276490 0.260517 0.257860 0.248605 0.219036 0.217541 0.387748
chargesum: 0.00000
title: Mulliken charges with hydrogens summed into heavy atoms:
elementType: F O O O O N C C C C C C C C C C C C C C C C C C C
charge: -0.202463 -0.262263 -0.253939 -0.024642 -0.199194 -0.223007 0.263679 0.132022 0.237336 0.086823 0.053011 -0.284758 -0.067001 -0.030263 -0.028555 0.327116 -0.137007 0.304998 0.201010 -0.052832 -0.067380 -0.123317 -0.118216 0.319862 0.148978
polarizability: 3.23700753e+02 -2.61220106e+00 2.46923740e+02 -4.19605574e+00 2.30831556e+01 1.48122484e+02
1716.lowfreq: -2.1563 -0.0005 0.0002 0.0005 0.9631 5.0357 21.9451 27.0028 29.4550
frequency: 21.9100 26.9640 29.4518 38.6906 50.3440 60.8933 80.8988 108.5570 111.7165 136.8443 149.7368 155.2024 182.4181 188.8268 217.0795 221.1651 262.0448 272.4332 290.9603 297.9468 328.8970 346.1149 372.1130 391.0278 404.3087 412.0662 416.4095 439.5866 468.2898 480.0012 489.6792 511.0773 547.7039 577.1354 592.7458 607.9784 623.7935 625.7265 638.4345 640.5199 681.0412 703.9791 730.7066 743.3581 771.9236 785.0737 812.2736 821.9564 828.4069 830.4865 844.4013 853.7704 905.5158 912.4103 955.9851 962.4871 973.1476 975.1424 998.7780 1006.6854 1026.2230 1038.6694 1043.7825 1075.5209 1104.7898 1112.6390 1133.8789 1148.6013 1155.3130 1158.3991 1197.9004 1203.6114 1214.3330 1252.5831 1259.7830 1280.4038 1292.9822 1315.9151 1353.6005 1370.3112 1376.5110 1392.0609 1403.0586 1406.4272 1409.1262 1432.9814 1439.4098 1456.3491 1465.9131 1466.2719 1475.8038 1483.3075 1486.0654 1489.0812 1517.1260 1546.0047 1581.2674 1595.3768 1605.3195 1631.1057 1687.4279 2952.9286 2967.7568 3023.1541 3038.5601 3039.5490 3079.4500 3118.5380 3124.0314 3155.8708 3156.6809 3157.7114 3158.0330 3176.8714 3177.8928 3180.2692 3518.8933
redmass: 8.8604 9.2898 7.5214 7.0445 3.6900 5.6580 4.9940 3.5792 5.9611 3.4359 1.2520 4.9441 4.0979 3.0624 4.0273 2.1902 2.2012 4.3800 3.1944 5.9035 4.5545 6.2435 6.9779 5.8005 6.0836 4.1978 3.7144 2.9308 2.9586 2.9868 3.5696 3.6730 4.9434 4.9002 3.9380 5.9060 2.9819 6.2481 2.4494 2.2975 5.8461 4.2720 5.9089 3.2861 4.1701 6.1150 1.7634 1.3666 1.5404 4.1124 3.0851 2.2491 3.5515 4.1727 1.3386 1.3989 1.3704 2.5389 4.7653 2.7129 2.4140 2.6369 1.5161 2.2847 1.3093 1.2609 1.6816 1.6691 1.4632 1.5994 2.0497 2.5694 2.1602 3.0343 1.7383 1.6408 1.2609 2.4488 1.6744 4.2747 5.6034 1.5642 3.8369 4.6507 3.2433 1.3096 1.1366 1.2917 1.0507 1.8915 1.3661 1.4083 2.3278 2.3488 6.6392 6.0758 8.4896 7.8061 6.4298 7.2330 8.9228 1.0334 1.0407 1.0608 1.1037 1.0965 1.1006 1.0950 1.0987 1.0888 1.0904 1.0881 1.0887 1.0966 1.0969 1.0975 1.0643
irintensity: 0.7519 1.1857 0.2855 0.2253 0.6024 1.2349 1.2355 2.0631 9.2763 1.5669 0.0705 0.5243 1.2441 0.7432 0.8963 1.3885 3.4870 7.5438 1.4071 4.9444 1.3687 0.7463 3.7655 2.0581 13.0825 0.7398 0.1512 4.5005 5.6361 18.2221 21.0125 4.2737 50.3425 25.5006 3.4115 20.8308 31.9751 0.5863 49.6811 72.5497 8.6924 3.6193 12.9355 8.0119 16.5058 8.6130 3.9007 35.1448 45.2042 2.6321 39.1421 32.9419 29.5434 63.3506 1.2155 2.3491 2.5991 25.9587 71.3536 5.5785 14.6237 375.9163 20.7125 16.3036 10.4874 0.3222 52.3318 60.8871 94.8136 35.4482 12.3001 89.3241 15.9735 169.4616 27.8349 28.6453 1.6671 23.7318 19.5516 13.2074 25.3270 32.1972 65.4968 143.2183 84.4675 20.1720 57.8725 4.8206 13.9575 75.4982 36.8962 16.4243 78.8218 44.9478 232.3935 241.0715 10.7463 29.4555 103.5632 80.2688 167.4936 66.8750 42.8076 21.0488 48.5136 17.0460 1.0842 0.0366 26.0700 10.7226 6.6921 0.7206 0.4585 4.4411 4.6549 6.0969 36.5697
temp: 298.150 k
press: 1.00000 atm
elementType: 9 8 8 8 8 7 6 6 6 6 6 6 6 6 6 6 6 6 6 6 6 6 6 6 6 1 1 1 1 1 1 1 1 1 1 1 1 1 1 1 1
symmnumber: 1
zpe: 807638.7 jmol-1
zpe.correction: 0.307613 hartree
zpe.thermalcorrener: 0.330390 hartree
zpe.thermalcorrenthalpy: 0.331335 hartree
zpe.thermalcorrgfe: 0.253268 hartree
zpe.sumelectzpe: -1187.348252 hartree
zpe.sumelectthermal: -1187.325475 hartree
zpe.sumelectthermalent: -1187.324531 hartree
zpe.sumelectthermalfe: -1187.402598 hartree
dipole: -7.3520 -0.1791 0.3821
dipole: 7.3641
quadrupole: -122.4475 -144.6402 -147.3897
quadrupole: 4.1544 -7.0388 -1.3490
quadrupole: 15.7116 -6.4810 -9.2306 4.1544 -7.0388 -1.3490
hfenergy: -1187.6558658 hartree
pointgroup: C01 [X(C19H16F1N1O4)]
dipole: 2.7444023 -0.9285255 0.0121931 debye
polarizability: 316.6296757|-27.7091634|218.8261162|-13.835437|-50.76905|183.2911851 unknown
InChI: InChI=1S/C19H16FNO4/c1-11-18(19(24)12-3-5-13(20)6-4-12)15-8-7-14(25-2)9-16(15)21(11)10-17(22)23/h3-9,22H,10H2,1-2H3
charge 0 multiplicity 1
41 atoms
F  -5.660229 2.156537 -2.105531
O  3.609656 2.716086 -1.299997
O  -2.377958 -1.129628 2.255763
O  4.359033 -3.695119 -0.107725
O  2.269418 -3.389243 -1.09334
N  1.699815 -1.364338 0.907408
C  1.743188 -0.095513 0.293662
C  0.415334 0.43681 0.308672
C  0.384692 -1.65302 1.30514
C  -0.442715 -0.568094 0.942873
C  2.842937 -2.247675 1.047323
C  2.8601 0.595946 -0.227163
C  0.222683 1.753855 -0.191023
C  0.03555 -2.959896 1.95162
C  -1.885664 -0.514949 1.245855
C  2.61984 1.891624 -0.737625
C  1.314611 2.466273 -0.708538
C  -2.823316 0.244003 0.342911
C  3.074377 -3.141319 -0.178456
C  -2.589493 0.383582 -1.05115
C  -4.033811 0.740424 0.897251
C  -3.539224 1.016269 -1.881069
C  -4.985604 1.39241 0.089436
C  -4.711642 1.513688 -1.285824
C  4.97232 2.188559 -1.364134
H  2.704847 -2.913837 1.917599
H  3.761136 -1.667582 1.241604
H  3.858696 0.150304 -0.240253
H  -0.766285 2.219675 -0.175157
H  0.506607 -3.06365 2.949372
H  -1.051252 -3.003462 2.11176
H  0.35024 -3.819359 1.329329
H  1.193961 3.479043 -1.103802
H  -1.672965 -0.019997 -1.491781
H  -4.213754 0.593458 1.966701
H  -3.383734 1.121092 -2.958521
H  -5.917166 1.792292 0.499811
H  5.566645 2.981575 -1.841109
H  5.019804 1.267458 -1.978366
H  5.373742 1.98141 -0.352145
H  4.502881 -4.315395 -0.872984
