program: Gaussian 09
title: 000033075
version: EM64L-G09RevD.01
frameworkgroup: C1[X(C12H13ClN2O2)]
method: RPBEPBE
basis: SDD
operation: Freq
keyword: #p
keyword: freq=noraman
keyword: PBEPBE/SDD
title: #p freq=noraman PBEPBE/SDD
converged: YES YES NO NO
title: Mulliken charges:
elementType: Cl O O N N C C C C C C C C C C C C H H H H H H H H H H H H H
charge: -0.056503 -0.244119 -0.248854 -0.112945 0.016592 -0.336224 -0.343913 -0.299618 -0.309069 -0.358367 0.278737 0.082589 -0.305162 -0.333608 -0.225396 -0.224752 -0.096616 0.237373 0.232515 0.244506 0.228076 0.228447 0.203450 0.201871 0.231259 0.226109 0.289707 0.284472 0.252169 0.257273
chargesum: 0.00000
title: Mulliken charges with hydrogens summed into heavy atoms:
elementType: Cl O O N N C C C C C C C C C C C C
charge: -0.056503 -0.244119 -0.248854 -0.112945 0.016592 0.133664 0.128669 0.132279 0.124060 -0.132258 0.278737 0.082589 -0.015456 -0.049136 0.026773 0.032521 -0.096616
polarizability: 2.76699482e+02 2.26257561e+00 1.80143550e+02 2.59569025e+00 1.85293244e+00 7.94133142e+01
1716.lowfreq: -10.0415 -6.0412 -4.2261 0.0012 0.0014 0.0020 11.7991 29.8563 45.8678
frequency: 8.6948 29.8074 45.8529 57.5384 89.1083 143.4687 162.4839 187.9689 208.8686 250.7072 261.6426 297.4729 304.2713 337.9728 372.2229 381.5665 408.8515 457.9589 459.9885 474.1904 498.7593 550.9669 613.4724 624.4522 663.8431 671.7374 743.5399 751.0285 778.5478 808.1791 832.0989 841.0499 854.0091 896.8473 916.0229 987.2667 993.1878 996.1568 1000.2658 1009.9958 1051.0944 1068.9217 1075.3239 1080.6861 1098.1117 1104.3415 1150.7781 1175.8216 1181.8585 1192.3911 1256.8751 1276.3305 1289.6186 1291.9208 1303.6502 1331.6038 1342.7623 1356.9879 1364.7943 1369.8926 1378.3472 1395.9886 1448.0424 1450.2541 1453.9446 1459.4662 1470.2431 1505.9669 1537.2968 1580.5232 1593.0138 2953.4709 2956.8374 2962.7737 2967.9157 3054.2435 3063.3741 3085.2204 3091.4474 3095.4339 3153.7808 3160.9952 3173.9099 3183.5490
redmass: 3.6517 3.9750 4.9811 6.5322 9.9782 5.6536 5.0519 6.8095 2.0517 3.4695 4.1644 5.6941 11.6190 4.7204 3.2782 2.5183 2.9508 6.4636 2.9586 3.4648 7.1190 4.1016 2.8233 6.3831 4.3667 4.3445 3.4794 5.0733 4.6324 3.8458 1.6201 1.2503 1.5347 1.6478 2.3332 1.3647 2.7124 1.3541 4.0276 2.4474 1.9124 3.6419 3.0620 3.6321 2.1460 1.3627 2.2037 2.5513 1.2138 1.0673 1.4941 1.2992 1.2580 1.8043 1.7409 1.2729 1.2654 1.3848 2.3499 2.9828 1.6845 4.1401 1.0809 1.0825 1.1004 1.0981 2.4524 8.5601 5.4189 7.8347 6.3196 1.0694 1.0699 1.0641 1.0654 1.0925 1.0896 1.0939 1.0963 1.0980 1.0885 1.0899 1.0964 1.0960
irintensity: 0.0295 0.0432 2.1992 1.3389 1.8739 1.4130 5.0674 3.1260 4.1080 25.8275 4.9495 1.2363 0.1507 1.1525 19.5448 13.8855 0.0295 8.4452 1.8543 13.7283 27.8905 10.7887 23.1189 0.2827 13.2943 12.5234 11.0804 23.7679 64.3342 14.6142 8.7555 1.2371 74.9989 24.0462 3.8559 2.3636 121.0375 0.5710 26.4815 18.1945 19.7130 29.7499 39.9380 76.4198 27.7233 10.5902 172.1679 18.2021 9.9351 0.1402 7.4348 5.5173 4.9269 65.9613 324.2826 32.7401 6.7468 12.6595 4.5441 20.7821 24.1935 20.1794 12.1902 3.5639 60.1410 4.0532 22.2271 122.8568 320.1473 53.2130 79.1175 47.1763 36.1865 17.2103 105.7334 17.7361 38.5988 16.6048 25.9713 32.5373 0.3430 2.1121 4.1079 17.7731
temp: 298.150 k
press: 1.00000 atm
elementType: 17 8 8 7 7 6 6 6 6 6 6 6 6 6 6 6 6 1 1 1 1 1 1 1 1 1 1 1 1 1
symmnumber: 1
zpe: 607175.8 jmol-1
zpe.correction: 0.231261 hartree
zpe.thermalcorrener: 0.246822 hartree
zpe.thermalcorrenthalpy: 0.247766 hartree
zpe.thermalcorrgfe: 0.184958 hartree
zpe.sumelectzpe: -1183.778664 hartree
zpe.sumelectthermal: -1183.763103 hartree
zpe.sumelectthermalent: -1183.762159 hartree
zpe.sumelectthermalfe: -1183.824967 hartree
dipole: -4.5608 -2.1968 0.3035
dipole: 5.0714
quadrupole: -108.4800 -110.5093 -107.7789
quadrupole: -1.2142 -2.5999 0.0877
quadrupole: 0.4428 -1.5866 1.1438 -1.2142 -2.5999 0.0877
hfenergy: -1184.0099246 hartree
pointgroup: C01 [X(C12H13Cl1N2O2)]
dipole: 1.9093821 0.3221272 0.4811612 debye
polarizability: 270.7000622|22.1030109|95.1947212|-22.3723212|31.6986472|170.3615633 unknown
InChI: InChI=1S/C12H13ClN2O2/c13-11-3-1-10(2-4-11)12(16)9-14-15-5-7-17-8-6-15/h1-4,9H,5-8H2
charge 0 multiplicity 1
30 atoms
Cl -5.272735 0.264857 2.731909
O  5.242886 0.913333 0.085799
O  -1.328501 -1.100587 -2.645481
N  2.449685 0.382337 -0.294262
N  1.105289 0.188206 -0.354702
C  2.903102 1.267781 0.800882
C  3.387355 0.212835 -1.433132
C  4.327117 0.888596 1.238604
C  4.807566 -0.080329 -0.902641
C  0.519149 -0.332898 -1.427428
C  -1.933521 -0.370028 -0.43051
C  -0.929429 -0.615184 -1.528081
C  -1.621942 0.156339 0.853217
C  -3.286915 -0.698417 -0.724713
C  -2.634964 0.3506 1.81689
C  -4.307633 -0.510532 0.226292
C  -3.962018 0.014306 1.48827
H  2.18757 1.163853 1.633098
H  2.894159 2.324049 0.457873
H  3.386388 1.127871 -2.062863
H  3.064604 -0.638348 -2.058172
H  4.724588 1.625634 1.954214
H  4.332489 -0.121352 1.702013
H  4.831616 -1.095527 -0.451132
H  5.539029 -0.02733 -1.724897
H  1.051836 -0.601618 -2.354242
H  -0.58696 0.411631 1.08761
H  -3.512954 -1.103162 -1.716482
H  -2.396999 0.755965 2.804672
H  -5.346157 -0.764479 -0.004004
