program: Gaussian 09
title: 000033146
version: EM64L-G09RevD.01
frameworkgroup: C1[X(C15H16ClN3)]
method: RPBEPBE
basis: SDD
operation: Freq
keyword: #p
keyword: freq=noraman
keyword: PBEPBE/SDD
title: #p freq=noraman PBEPBE/SDD
converged: YES YES NO NO
title: Mulliken charges:
elementType: Cl N N N C C C C C C C C C C C C C C C H H H H H H H H H H H H H H H H
charge: -0.049629 -0.391709 -0.124808 -0.687287 -0.486221 0.547369 -0.535666 0.400843 -0.313112 -0.403084 0.264006 -0.385502 -0.405300 -0.224847 -0.232971 -0.227518 -0.233100 -0.227278 -0.245073 0.222702 0.263795 0.289057 0.210726 0.207824 0.240645 0.218199 0.279837 0.255709 0.232887 0.235596 0.218974 0.218875 0.222012 0.308748 0.335301
chargesum: 0.00000
title: Mulliken charges with hydrogens summed into heavy atoms:
elementType: Cl N N N C C C C C C C C C C C C C C C
charge: -0.049629 -0.102651 -0.124808 -0.043239 0.000276 0.547369 -0.117117 0.400843 -0.313112 -0.162439 0.264006 -0.167303 -0.125463 0.030862 -0.000083 0.008078 -0.014126 -0.008403 -0.023060
polarizability: 2.68717033e+02 -3.73571032e+00 1.61546713e+02 -2.31522711e+01 1.32587530e+01 1.44875873e+02
1716.lowfreq: -8.2065 -7.2232 -0.0008 0.0014 0.0020 4.5527 8.9115 18.9712 28.2023
frequency: 5.9522 18.7805 28.1844 34.6198 57.9134 79.0060 136.8780 159.3421 162.5382 195.9651 224.8478 231.2131 248.9827 287.8836 334.0021 372.3553 380.8872 406.6640 415.5483 421.1809 434.9348 444.2397 464.8844 489.4345 536.8948 575.9263 591.2854 615.8554 642.6822 662.0921 669.5850 705.0141 727.7383 737.6001 760.1957 805.9078 828.2713 856.7653 868.2208 891.3506 906.9098 943.0276 957.8411 978.5800 984.1703 986.3962 989.6499 1008.8433 1016.0091 1024.1124 1025.0887 1038.1192 1072.1591 1118.3330 1127.7815 1132.8992 1165.7896 1171.9071 1174.8670 1201.6713 1206.3081 1216.0856 1225.1156 1269.0763 1291.0597 1307.5164 1339.7598 1356.4021 1376.8975 1388.8056 1425.5658 1435.7434 1445.5141 1461.4753 1481.1004 1481.4539 1490.0097 1576.0546 1593.2973 1604.6825 1615.7777 1616.7685 1655.8910 2861.4964 2897.8352 2957.1525 3053.2221 3100.4737 3119.4779 3125.4605 3133.5544 3141.4946 3153.2819 3159.1806 3169.7596 3174.3103 3548.0526 3559.1858 3694.6710
redmass: 6.8717 4.7501 5.2915 4.5726 4.2658 4.5482 4.5446 5.2188 5.2374 3.1993 4.2247 3.6975 3.0645 3.8353 4.8839 3.6986 1.2175 2.8555 1.3415 3.6463 1.7882 2.0225 2.7193 2.8286 4.0304 4.3423 4.4176 6.3283 4.6631 6.8445 6.2477 2.3436 4.0949 1.3764 1.2349 4.3713 3.7963 1.2551 1.4653 3.4093 1.4145 1.4849 1.8248 1.4119 1.6069 1.3340 6.1766 1.4357 2.3913 2.8428 2.6855 2.1572 1.5510 2.6938 1.9161 2.9166 1.0779 1.0608 1.1164 1.5178 1.7171 2.1730 1.0969 1.3539 1.4972 1.5979 1.5161 1.8258 6.1821 6.0896 2.1592 1.9886 1.1595 2.3232 2.2450 1.1584 2.1888 6.1165 5.8201 7.1959 6.0625 1.2742 4.4707 1.0555 1.0996 1.0694 1.0909 1.0875 1.0862 1.0877 1.0928 1.0891 1.0983 1.0947 1.0955 1.0997 1.0464 1.0761 1.1025
irintensity: 0.3052 0.1285 0.7376 0.3360 5.0019 1.1458 7.0372 1.6581 1.6398 1.3779 5.8902 6.3245 0.9780 2.5228 0.4260 15.9091 67.2456 0.7846 222.8115 19.9975 83.8675 70.8999 11.7803 43.8184 5.6576 11.3617 16.3580 0.1002 7.9868 2.6018 20.9710 24.4424 2.0759 89.9159 84.8951 1.8331 7.9788 0.1012 0.8058 15.6872 1.5150 0.9846 2.1938 0.1327 1.2716 0.0675 0.2659 2.7290 13.0749 41.2334 14.7640 5.3713 12.1175 7.2882 8.5205 11.1347 3.8112 2.6673 6.4688 22.3924 21.9253 0.8970 2.4520 1.5901 69.8574 45.2234 51.5047 30.4979 2.2642 21.2871 26.5419 33.0084 39.8039 41.2993 23.7329 24.9677 264.0220 9.3054 20.3179 0.0824 33.1113 137.1031 587.8551 72.0244 45.8733 45.1752 8.1487 14.6605 1.0412 5.4640 39.4662 8.7654 38.5174 17.3110 11.7398 15.4619 21.1893 16.6286 18.3554
temp: 298.150 k
press: 1.00000 atm
elementType: 17 7 7 7 6 6 6 6 6 6 6 6 6 6 6 6 6 6 6 1 1 1 1 1 1 1 1 1 1 1 1 1 1 1 1
symmnumber: 1
zpe: 731186.0 jmol-1
zpe.correction: 0.278494 hartree
zpe.thermalcorrener: 0.296527 hartree
zpe.thermalcorrenthalpy: 0.297471 hartree
zpe.thermalcorrgfe: 0.227952 hartree
zpe.sumelectzpe: -1204.138283 hartree
zpe.sumelectthermal: -1204.120250 hartree
zpe.sumelectthermalent: -1204.119306 hartree
zpe.sumelectthermalfe: -1204.188826 hartree
dipole: 3.3030 3.0817 -0.6596
dipole: 4.5652
quadrupole: -103.3867 -103.8376 -119.7558
quadrupole: -5.0753 -7.3683 3.9617
quadrupole: 5.6067 5.1558 -10.7624 -5.0753 -7.3683 3.9617
hfenergy: -1204.4167773 hartree
pointgroup: C01 [X(C15H16Cl1N3)]
dipole: 1.3297724 1.2069559 -0.0307049 debye
polarizability: 270.6459014|-3.8789045|157.8727989|-16.9806468|15.3176933|146.6209193 unknown
InChI: InChI=1S/C15H16ClN3/c16-14-9-5-4-8-13(14)11-19-15(17)18-10-12-6-2-1-3-7-12/h1-9,19H,10-11,17H2
charge 0 multiplicity 1
35 atoms
Cl 2.094887 -0.462299 2.336142
N  1.170297 1.509431 -0.262477
N  -1.149675 1.115794 -0.307749
N  -0.230934 3.191301 0.564811
C  1.467327 0.142933 -0.713142
C  2.890248 -0.255631 -0.355968
C  -2.506387 1.48981 0.119669
C  -3.500864 0.341295 -0.061917
C  3.305348 -0.539544 0.968466
C  3.876844 -0.362171 -1.371572
C  -0.147015 1.910023 -0.011865
C  -4.858289 0.524358 0.30671
C  -3.098386 -0.905465 -0.59386
C  4.626537 -0.905652 1.289891
C  5.210262 -0.725619 -1.079212
C  5.586493 -0.996274 0.255507
C  -5.796262 -0.519456 0.149149
C  -4.035444 -1.95319 -0.752334
C  -5.386891 -1.765868 -0.3822
H  1.31769 0.034241 -1.807787
H  0.724138 -0.514336 -0.228181
H  1.863395 2.233336 -0.454883
H  -2.888528 2.357857 -0.470355
H  -2.536397 1.80924 1.190747
H  3.580062 -0.157611 -2.407474
H  -5.184726 1.488154 0.721131
H  -2.048221 -1.022669 -0.875853
H  4.897122 -1.122635 2.327355
H  5.947332 -0.800181 -1.885575
H  6.615774 -1.281717 0.497397
H  -6.841755 -0.36345 0.439965
H  -3.71028 -2.915652 -1.165066
H  -6.112635 -2.578193 -0.504728
H  0.538831 3.556591 1.1217
H  -1.139397 3.635849 0.65856
