program: Gaussian 09
title: 000033121
version: EM64L-G09RevD.01
frameworkgroup: C1[X(C12H18Br6)]
method: RPBEPBE
basis: SDD
operation: Freq
keyword: #p
keyword: freq=noraman
keyword: PBEPBE/SDD
title: #p freq=noraman PBEPBE/SDD
converged: NO YES NO NO
title: Mulliken charges:
elementType: Br Br Br Br Br Br C C C C C C C C C C C C H H H H H H H H H H H H H H H H H H
charge: 0.036505 0.017601 0.017628 0.008208 0.008199 0.021991 -0.418158 -0.480741 -0.480745 -0.527552 -0.527508 -0.535417 -0.381052 -0.381210 -0.362032 -0.362013 -0.274148 -0.274135 0.260430 0.316990 0.317018 0.288866 0.288800 0.287810 0.220740 0.300396 0.300400 0.220795 0.290269 0.243168 0.243195 0.290240 0.259000 0.253737 0.253742 0.258980
chargesum: 0.00000
title: Mulliken charges with hydrogens summed into heavy atoms:
elementType: Br Br Br Br Br Br C C C C C C C C C C C C
charge: 0.036505 0.017601 0.017628 0.008208 0.008199 0.021991 -0.157729 -0.163752 -0.163727 -0.238686 -0.238708 -0.247607 0.140084 0.139985 0.171405 0.171423 0.238590 0.238587
polarizability: 2.31630692e+02 -2.02068617e-02 2.41782480e+02 -5.14222259e-02 1.82135536e+01 2.11586389e+02
1716.lowfreq: -8.9996 -6.4245 -4.9899 -4.0069 0.0003 0.0004 0.0004 7.9028 34.9300
frequency: -4.2411 6.4969 34.9256 43.5241 43.8132 58.4534 77.5175 83.4987 87.6009 99.4880 119.0508 126.8559 143.3169 169.4036 176.4525 205.8099 219.1752 277.7381 279.5192 292.7575 321.1514 324.2447 337.2144 346.0807 364.3964 403.2229 420.1047 453.1339 497.3101 549.5609 565.0922 570.5451 582.0557 606.3154 616.0518 704.3554 807.2414 829.7095 848.4748 873.5472 885.9627 900.9188 919.6710 940.2777 950.9447 1000.9914 1035.5641 1040.6640 1065.1008 1070.7772 1084.8859 1099.4659 1107.1417 1118.4969 1139.9362 1147.6886 1165.7611 1171.2707 1188.8196 1191.3833 1202.9128 1204.1231 1225.4936 1228.8538 1254.4608 1263.0137 1273.6912 1281.2517 1311.1139 1317.4391 1328.8314 1329.3795 1338.3714 1339.6320 1345.7886 1357.4834 1367.5986 1367.6661 1432.9476 1449.8131 1453.6453 1458.7636 1462.9624 1469.7614 2939.6662 2950.1444 2993.5127 2994.2452 3023.5443 3023.8690 3051.3803 3057.3572 3058.2310 3059.4745 3060.1259 3074.4933 3075.6357 3078.8926 3082.6489 3087.9433 3093.2152 3102.8745
redmass: 38.9442 24.6801 44.1076 23.3651 15.9082 30.4891 12.5577 21.2743 18.5478 18.4643 8.4497 10.8281 3.8973 16.5627 4.6309 4.3302 5.9535 3.4375 2.6232 3.0886 4.9527 3.3905 2.6670 3.3252 2.7318 3.0359 3.5445 2.3990 2.3620 3.3576 2.3561 3.9296 3.3658 3.8515 4.4178 4.1839 2.0431 2.4331 2.2000 1.9959 3.1466 2.1514 2.2927 1.8270 2.2410 2.3749 2.3956 3.3869 3.2410 3.1238 2.6577 2.3831 1.4503 1.5114 1.4669 1.8029 1.3004 1.1572 1.1507 1.2478 1.1938 1.2081 1.2059 1.1930 1.2386 1.1963 1.2713 1.1875 1.2122 1.2459 1.3428 1.2894 1.2680 1.2585 1.4555 1.3148 1.3945 1.4095 1.0717 1.0723 1.0767 1.0767 1.0803 1.0784 1.0705 1.0689 1.0648 1.0646 1.0606 1.0616 1.0858 1.0889 1.0897 1.0911 1.0908 1.0896 1.0891 1.0959 1.0861 1.0936 1.0959 1.0924
irintensity: 0.1473 0.2205 0.0430 0.7767 0.0862 0.0076 1.0900 1.2494 0.2132 0.0920 2.4854 0.6366 0.0044 1.2100 0.6920 4.1530 7.6625 10.9176 2.0741 3.9276 4.9503 0.0067 6.8966 4.8362 1.8024 6.9435 8.2618 7.8741 0.7171 22.4418 0.0192 38.5753 10.4241 38.2076 0.4383 21.3889 10.1791 4.3454 0.2491 14.0498 3.9927 31.5105 22.8527 8.8583 33.6343 0.0351 0.6654 0.6170 2.7480 7.4451 17.7793 9.3036 1.1766 22.6010 8.2056 14.5656 0.0210 27.5759 25.2689 10.6913 40.8503 56.6852 1.0322 20.6934 17.0540 3.3572 15.8067 3.3430 8.2636 0.0054 0.1483 12.2148 29.4806 1.3374 12.3832 6.9675 1.1699 0.9522 0.2779 25.3044 12.1470 50.0480 0.3819 20.5740 1.1483 41.6860 13.5072 13.0881 1.0689 3.4466 11.3873 0.0713 0.1294 0.1156 1.5849 0.0712 4.0719 10.2513 44.5405 3.8674 40.4000 10.1441
temp: 298.150 k
press: 1.00000 atm
elementType: 35 35 35 35 35 35 6 6 6 6 6 6 6 6 6 6 6 6 1 1 1 1 1 1 1 1 1 1 1 1 1 1 1 1 1 1
symmnumber: 1
zpe: 727707.4 jmol-1
zpe.correction: 0.277169 hartree
zpe.thermalcorrener: 0.298237 hartree
zpe.thermalcorrenthalpy: 0.299181 hartree
zpe.thermalcorrgfe: 0.220961 hartree
zpe.sumelectzpe: -547.410160 hartree
zpe.sumelectthermal: -547.389093 hartree
zpe.sumelectthermalent: -547.388149 hartree
zpe.sumelectthermalfe: -547.466369 hartree
dipole: 0.0057 -1.6957 -2.0616
dipole: 2.6694
quadrupole: -184.3626 -184.8614 -169.7468
quadrupole: 0.0049 0.0276 -5.8684
quadrupole: -4.7057 -5.2045 9.9101 0.0049 0.0276 -5.8684
hfenergy: -547.6873293 hartree
pointgroup: C01[X(C12H18Br6)]
dipole: 0.0003091 0.5493956 0.8950482 debye
polarizability: 231.6306519|-0.0117352|236.2565655|0.0076976|21.6347465|217.1123434 unknown
InChI: InChI=1S/C12H18Br6/c13-7-1-8(14)3-10(16)5-12(18)6-11(17)4-9(15)2-7/h7-12H,1-6H2
charge 0 multiplicity 1
36 atoms
Br -0.006461 -3.414884 -1.290495
Br 3.594266 -2.512325 -0.905618
Br -3.602913 -2.499811 -0.906258
Br 3.147126 1.72065 1.969841
Br -3.139429 1.730495 1.971777
Br 0.005888 3.75836 -2.441368
C  -0.003651 -1.904068 0.08683
C  2.564144 -1.290861 0.376967
C  -2.569215 -1.282026 0.37691
C  1.754049 1.161099 0.558633
C  -1.7497 1.166715 0.55902
C  0.003736 2.27175 -1.016774
C  1.287035 -1.962424 0.936009
C  -1.294465 -1.957952 0.9361
C  2.374889 0.064924 -0.331146
C  -2.375371 0.073325 -0.330812
C  1.324235 2.430995 -0.213849
C  -1.315765 2.435422 -0.213083
H  -0.002163 -1.009267 -0.553856
H  3.289522 -1.186642 1.200486
H  -3.294409 -1.175602 1.200307
H  0.948138 0.774657 1.199123
H  -0.944614 0.776719 1.198361
H  0.00206 1.361895 -1.641426
H  1.074639 -1.438477 1.894766
H  1.51518 -3.005755 1.215091
H  -1.526223 -3.000502 1.215103
H  -1.080319 -1.43479 1.894885
H  3.352666 0.419802 -0.701293
H  1.742171 -0.070246 -1.231258
H  -1.743759 -0.063843 -1.231403
H  -3.352058 0.432004 -0.700177
H  1.203863 3.275432 0.486825
H  2.142902 2.699013 -0.904388
H  -2.133844 2.706716 -0.903033
H  -1.19195 3.279101 0.487904
