program: Gaussian 09
title: 000033070
version: EM64L-G09RevD.01
frameworkgroup: C1[X(C13H15N3O3)]
method: RPBEPBE
basis: SDD
operation: Freq
keyword: #p
keyword: freq=noraman
keyword: PBEPBE/SDD
title: #p freq=noraman PBEPBE/SDD
converged: YES YES NO NO
title: Mulliken charges:
elementType: O O O N N N C C C C C C C C C C C C C H H H H H H H H H H H H H H H
charge: -0.243701 -0.210362 -0.206762 -0.086477 0.013127 0.024297 -0.404628 -0.379141 -0.385377 -0.362942 -0.374829 -0.362618 0.086201 0.283367 -0.287877 -0.327520 0.384856 -0.374877 -0.373040 0.200648 0.230687 0.213568 0.211792 0.213338 0.215407 0.215912 0.242652 0.230055 0.231764 0.227723 0.296615 0.290650 0.281507 0.285985
chargesum: 0.00000
title: Mulliken charges with hydrogens summed into heavy atoms:
elementType: O O O N N N C C C C C C C C C C C C C
charge: -0.243701 -0.210362 -0.206762 -0.086477 0.013127 0.024297 0.026707 0.046219 0.043368 0.095622 0.086990 -0.134895 0.086201 0.283367 0.008738 -0.036870 0.384856 -0.093370 -0.087055
polarizability: 3.10380585e+02 -1.18810697e+01 1.99650213e+02 -4.50226397e+00 3.12264325e+00 8.87485659e+01
1716.lowfreq: -9.4461 -5.7810 0.0005 0.0005 0.0007 1.7499 9.4177 27.9018 41.7212
frequency: 3.0166 27.7952 41.6568 55.8071 63.2356 83.7723 138.5151 151.9008 179.8109 205.5095 241.2120 251.1651 273.3171 300.0054 330.3532 352.7743 378.7504 408.4456 440.3952 452.0302 458.4187 497.0904 499.8997 533.3243 601.8132 625.2642 651.8330 659.1591 685.6741 729.4168 763.4723 768.6047 794.2369 804.9486 848.2586 851.3008 868.1660 885.9583 899.3120 919.5902 946.8279 992.4414 1006.7598 1013.4195 1018.6283 1045.1109 1077.1486 1090.5663 1092.7448 1104.3486 1107.6003 1122.1748 1152.8148 1173.5309 1180.8689 1217.8734 1240.5130 1257.9354 1269.1301 1291.1457 1295.4104 1305.9700 1332.1758 1342.1276 1348.2556 1352.0259 1360.9232 1364.0410 1381.6379 1398.0732 1410.4879 1458.3096 1460.5221 1465.3536 1466.6576 1470.4900 1475.5877 1508.0388 1534.3173 1592.3670 1604.8182 2936.7242 2942.3639 2976.2322 2993.4323 2994.0964 3047.8795 3053.8846 3059.2763 3063.4796 3071.2922 3086.0639 3161.1395 3172.8690 3184.3454 3190.2191
redmass: 4.6505 3.5089 3.7555 5.5214 7.6111 9.0223 5.1539 4.7212 4.7068 2.2436 4.0030 3.2819 6.2459 9.3720 2.7687 2.1790 4.2778 2.9240 3.0417 3.4408 4.0003 6.6678 6.8425 2.9235 3.6812 6.9740 5.5725 5.3504 3.7460 5.9302 4.4613 4.3605 1.9060 3.7451 1.4121 2.6910 1.2416 1.4897 1.7994 2.3775 1.3154 2.7081 3.2525 1.3436 1.3582 2.0134 3.5585 2.0814 1.7570 1.4209 1.9171 2.4598 1.3076 1.5821 1.7283 6.7660 2.0843 1.3030 1.2444 1.2652 1.8212 1.9110 1.2815 1.3816 1.4713 1.5409 5.5819 1.5424 2.2781 10.2979 4.1291 1.0888 1.0979 1.0853 1.0899 2.3987 1.0980 8.7491 4.9492 8.1464 6.3283 1.0699 1.0689 1.0648 1.0611 1.0616 1.0962 1.0992 1.0954 1.0995 1.0900 1.0928 1.0894 1.0893 1.0954 1.0967
irintensity: 0.0348 0.1026 0.5614 0.1519 0.0119 6.0553 1.0207 3.4184 3.0702 1.6329 2.7670 8.2815 2.1747 1.9356 6.2610 2.7720 23.8090 0.0260 0.3806 3.4004 2.9246 8.4305 3.7493 4.1035 0.7278 2.1937 2.3177 14.5509 34.9322 44.7787 35.8156 1.6513 9.0606 0.5515 43.0401 0.5060 0.0140 95.2551 6.9824 8.6499 5.4777 63.3359 7.0707 0.0322 0.0450 3.9469 67.7072 21.5766 15.5937 5.6420 79.1226 6.7415 8.9456 55.6133 66.0294 433.5123 3.9357 17.5460 9.3990 1.4618 13.3519 303.3092 19.7460 0.1484 1.9991 21.7378 77.5639 10.4315 45.5489 5.0856 35.0736 9.1743 43.8173 20.5367 24.4564 1.8381 6.0727 80.9688 388.4733 18.6306 9.1468 34.0416 56.9234 38.6017 28.8697 26.7421 63.4548 25.7534 10.3390 68.3095 32.2184 17.3083 2.5646 6.8119 0.6275 7.3237
temp: 298.150 k
press: 1.00000 atm
elementType: 8 8 8 7 7 7 6 6 6 6 6 6 6 6 6 6 6 6 6 1 1 1 1 1 1 1 1 1 1 1 1 1 1 1
symmnumber: 1
zpe: 699741.7 jmol-1
zpe.correction: 0.266518 hartree
zpe.thermalcorrener: 0.283661 hartree
zpe.thermalcorrenthalpy: 0.284605 hartree
zpe.thermalcorrgfe: 0.217152 hartree
zpe.sumelectzpe: -892.794853 hartree
zpe.sumelectthermal: -892.777709 hartree
zpe.sumelectthermalent: -892.776765 hartree
zpe.sumelectthermalfe: -892.844218 hartree
dipole: 10.4079 -1.4378 -0.4020
dipole: 10.5144
quadrupole: -115.0751 -122.6664 -110.9639
quadrupole: -14.8171 -0.9159 0.5588
quadrupole: 1.1601 -6.4313 5.2712 -14.8171 -0.9159 0.5588
hfenergy: -893.0613704 hartree
pointgroup: C01 [X(C13H15N3O3)]
dipole: -4.0347427 -0.8808379 0.2391244 debye
polarizability: 302.7066273|39.9534674|117.5978179|-18.3719398|40.2089802|178.474919 unknown
InChI: InChI=1S/C13H15N3O3/c17-13(10-14-15-8-2-1-3-9-15)11-4-6-12(7-5-11)16(18)19/h4-7,10H,1-3,8-9H2
charge 0 multiplicity 1
34 atoms
O  0.493306 1.419262 2.822801
O  4.374022 -0.544008 -3.104496
O  5.74857 0.518487 -1.627158
N  -2.989577 -0.564295 0.373115
N  -1.682701 -0.237199 0.504304
N  4.594236 0.062456 -1.98482
C  -5.763681 -1.223905 -0.258262
C  -4.669286 -1.254158 -1.348493
C  -5.419615 -0.151129 0.797961
C  -3.286311 -1.518459 -0.722312
C  -4.024781 -0.381144 1.423725
C  -1.21104 0.40008 1.575084
C  0.19218 0.818859 1.730959
C  1.284963 0.585898 0.706991
C  1.100992 -0.075244 -0.53921
C  2.579339 1.071992 1.047119
C  3.452537 0.245463 -1.053746
C  2.183175 -0.248289 -1.423394
C  3.668547 0.907798 0.175671
H  -5.835868 -2.219373 0.226435
H  -6.751341 -1.012824 -0.707218
H  -4.6518 -0.286168 -1.885528
H  -4.876974 -2.043682 -2.094362
H  -6.168583 -0.143223 1.611739
H  -5.438448 0.849077 0.324029
H  -3.255291 -2.555173 -0.319241
H  -2.474484 -1.418899 -1.460272
H  -3.756557 0.489368 2.045379
H  -4.037492 -1.275855 2.084652
H  -1.819017 0.672633 2.452213
H  0.108355 -0.446401 -0.798744
H  2.696584 1.576814 2.010989
H  2.064816 -0.754016 -2.385282
H  4.668121 1.274957 0.421872
