program: Gaussian 09
title: 000033068
version: EM64L-G09RevD.01
frameworkgroup: C1[X(C8H5Br2Cl2NO)]
method: RPBEPBE
basis: SDD
operation: Freq
keyword: #p
keyword: freq=noraman
keyword: PBEPBE/SDD
title: #p freq=noraman PBEPBE/SDD
converged: NO YES NO NO
title: Mulliken charges:
elementType: Br Br Cl Cl O N C C C C C C C C H H H H H
charge: 0.039748 0.041732 0.062698 0.062669 -0.197189 -0.445447 0.643293 -0.458749 -0.309799 -0.140168 -0.171661 -0.240359 0.369151 -0.738372 0.302413 0.321819 0.276032 0.258634 0.323555
chargesum: 0.00000
title: Mulliken charges with hydrogens summed into heavy atoms:
elementType: Br Br Cl Cl O N C C C C C C C C
charge: 0.039748 0.041732 0.062698 0.062669 -0.197189 -0.143035 0.643293 -0.458749 0.012020 0.135864 0.086973 -0.240359 0.369151 -0.414817
polarizability: 2.47228515e+02 5.60760216e+00 1.48623882e+02 -1.81594444e-02 2.46307913e-03 8.10721645e+01
1716.lowfreq: -11.0821 -0.0012 -0.0005 0.0020 2.2360 3.4179 4.6739 29.9530 58.6675
frequency: -10.7801 29.8282 58.6667 66.5546 114.1203 127.2418 147.0633 158.4994 202.2587 205.3855 243.7250 291.3191 299.9219 351.8399 364.1446 422.1692 441.4376 550.9976 598.9749 617.5648 655.9316 683.4662 712.0961 726.4573 732.4249 754.2836 843.0111 848.0032 872.1539 939.0388 985.3774 1005.8028 1075.0261 1128.2092 1148.0923 1186.1945 1240.9282 1263.1118 1294.7881 1350.0767 1383.4326 1441.7201 1498.5003 1565.7593 1591.4932 1637.8522 3100.0067 3171.9678 3185.1291 3191.4335 3460.6021
redmass: 18.6722 24.5660 8.2342 23.2974 34.1552 7.2844 5.3705 28.3728 11.5135 11.6559 19.0652 14.2877 9.9962 5.9268 9.5237 6.4294 3.4952 3.7686 8.8421 10.5092 8.0937 1.4017 7.1627 2.8147 7.8296 9.7426 5.8606 1.3859 1.3986 6.4378 1.3287 5.7192 2.3907 1.9409 1.3965 1.0645 1.5808 1.5458 1.7767 4.8768 5.1327 2.4123 2.3931 4.8636 6.2535 6.5365 1.0894 1.0903 1.0933 1.0963 1.0767
irintensity: 0.1683 0.7088 2.2873 1.5052 0.0671 2.2624 0.8775 0.2485 1.2763 1.3322 0.8754 2.0716 9.4452 0.2917 16.2727 3.0201 13.3370 27.9773 11.3353 75.1763 19.0484 36.2551 2.5951 39.8935 123.6509 35.6045 0.6053 55.0842 13.8101 1.1663 4.8810 40.8337 31.4599 46.4568 0.0666 9.3822 3.0561 26.9542 19.3571 109.0468 14.2567 78.0558 499.1608 68.6426 19.3764 149.2279 9.7321 3.4058 1.0366 10.6851 70.9169
temp: 298.150 k
press: 1.00000 atm
elementType: 35 35 17 17 8 7 6 6 6 6 6 6 6 6 1 1 1 1 1
symmnumber: 1
zpe: 298851.6 jmol-1
zpe.correction: 0.113827 hartree
zpe.thermalcorrener: 0.127178 hartree
zpe.thermalcorrenthalpy: 0.128122 hartree
zpe.thermalcorrgfe: 0.070152 hartree
zpe.sumelectzpe: -1383.856158 hartree
zpe.sumelectthermal: -1383.842807 hartree
zpe.sumelectthermalent: -1383.841863 hartree
zpe.sumelectthermalfe: -1383.899832 hartree
dipole: -1.3963 3.0123 0.0002
dipole: 3.3202
quadrupole: -124.0442 -112.8973 -116.9718
quadrupole: 10.9609 0.0020 0.0020
quadrupole: -6.0731 5.0738 0.9993 10.9609 0.0020 0.0020
hfenergy: -1383.9699846 hartree
pointgroup: C01 [X(C8H5Br2Cl2N1O1)]
dipole: 0.6203003 1.1495968 -0.000069 debye
dipolederiv: -0.1634761 0.1427274 -0.0000145 0.1357527 -0.6007706 0.000101 -0.0000731 0.0001531 0.0021153 -0.8028226 0.171156 0.0000531 0.1597376 -0.0884838 0.0000144 0.0001355 -0.0000722 -0.0101758 -0.3996235 -0.0123052 -0.2432159 -0.0346796 -0.0889376 -0.0855942 -0.2205685 -0.0320568 -0.5546691 -0.4000897 -0.0120687 0.2434644 -0.0344423 -0.0888807 0.0850697 0.2207567 0.0316467 -0.5547219 -0.6581884 0.0340154 -0.0000359 -0.5588369 -0.8568787 0.0003407 -0.0002701 -0.0001652 -0.2933362 -1.7332627 -0.3156961 0.0000655 -0.3848092 -0.5129578 0.0000347 -0.0001065 -0.000021 -0.2720444 0.9220863 0.1513777 -0.0001209 -0.2879144 -0.29324 0.0001217 -0.0000333 0.0001097 0.1451526 0.0540203 -0.3170442 0.0000375 -0.2199717 1.0591329 -0.0002116 0.0001521 -0.0002803 -0.1571283 -0.1143843 -0.1406815 0.0000051 0.0074242 -0.0192476 -0.000038 -0.0000133 0.0000309 -0.1311784 -0.417147 0.1713827 0.0000032 0.3085417 -0.2800185 0.0000108 -0.0000045 -0.0000054 -0.0127908 -0.3978144 0.0407184 0.0000363 0.0100721 0.0670295 -0.0000272 0.0000179 -0.000018 -0.078409 1.3219257 -0.2858273 -0.0001226 -0.3381675 0.1037208 -0.0000232 -0.0001967 0.0000813 -0.1450807 1.5355943 0.270262 0.0000394 0.8937365 1.1249818 -0.0003994 0.0004394 0.0000591 0.0734409 0.7481851 0.1247984 -0.0003059 0.1976442 0.1733032 0.0005639 -0.000343 0.000438 1.2629935 0.2661588 0.0778237 0.0000106 0.1705349 0.2435193 -0.0000111 0.0000297 0.0000383 0.2662208 0.1499007 -0.0145369 0.0000166 0.003653 0.0799894 0.0000152 0.0000504 -0.0000117 0.1812641 0.064163 -0.0461626 0.0000221 -0.0531305 0.0497423 0.000034 0.0000177 0.000036 0.1604441 0.0779432 0.041183 0.0000013 0.0514599 -0.0119811 0.0000211 -0.0000058 0.0000436 0.158396 -0.0531689 -0.0811221 0.0000605 -0.0266048 -0.0600229 -0.0000225 0.0000154 -0.0000061 -0.0404927 unknown
polarizability: 246.1849885|-11.5435196|149.6674094|-0.0182755|-0.0013557|81.0721645 unknown
InChI: InChI=1S/C8H5Br2Cl2NO/c9-4-1-2-6(5(10)3-4)13-8(14)7(11)12/h1-3,7,13H
charge 0 multiplicity 1
19 atoms
Br 0.857011 3.05125 -0.000641
Br 5.113121 -0.875837 -0.000359
Cl -4.340082 -0.011973 -1.533952
Cl -4.340801 -0.010199 1.533372
O  -1.993389 -1.629472 0.000169
N  -0.94579 0.48285 0.000175
C  0.426679 0.128948 0.000058
C  1.41055 1.159852 -0.000312
C  0.879629 -1.219513 0.000278
C  2.787933 0.879757 -0.000426
C  2.256546 -1.517107 0.000151
C  3.199354 -0.469946 -0.000195
C  -2.044931 -0.373385 0.000479
C  -3.375498 0.407735 -0.000299
H  -1.124453 1.493626 -0.000056
H  0.137176 -2.019815 0.000538
H  3.518101 1.691897 -0.000693
H  2.58432 -2.560044 0.000325
H  -3.262876 1.500774 -0.000911
