program: Gaussian 09
title: 000033069
version: EM64L-G09RevD.01
frameworkgroup: C1[X(C9H20N2)]
method: RPBEPBE
basis: SDD
operation: Freq
keyword: #pfreq=noraman
keyword: PBEPBE/SDD
title: #p freq=noraman PBEPBE/SDD
converged: YES YES NO NO
title: Mulliken charges:
elementType: N N C C C C C C C C C H H H H H H H H H H H H H H H H H H H H
charge: -0.077944 -0.548309 -0.021441 -0.389277 -0.424176 -0.410501 -0.357613 -0.327656 -0.741968 -0.419967 -0.384655 0.214925 0.208536 0.160288 0.210534 0.184889 0.189822 0.206365 0.169093 0.208610 0.181018 0.197395 0.212170 0.216366 0.206911 0.195423 0.191223 0.196537 0.237575 0.259615 0.256211
chargesum: 0.00000
title: Mulliken charges with hydrogens summed into heavy atoms:
elementType: N N C C C C C C C C C
charge: -0.077944 -0.032482 0.193484 -0.020453 -0.028754 -0.014314 0.020090 0.050757 -0.106521 -0.033321 0.049457
polarizability: 1.29866248e+02 -1.27227469e+00 1.05748847e+02 -2.84553106e+00 -9.55386765e-01 9.43513150e+01
1716.lowfreq: -18.5188 -6.7182 -0.0004 -0.0004 -0.0003 10.7062 36.5817 54.4077 79.2101
frequency: 28.0647 54.3269 79.1427 137.4533 161.0854 201.5645 206.2409 250.9349 267.6453 282.5763 293.1383 343.0947 367.5637 417.2769 428.5486 438.9982 522.3831 566.4741 605.1009 737.6630 770.5698 811.7894 846.0574 862.7240 889.8280 902.2052 919.3486 966.0537 971.7421 993.7913 1015.2043 1048.4983 1066.0158 1086.6827 1094.1496 1105.6736 1124.6806 1142.2512 1156.8645 1160.8138 1206.0539 1220.9802 1255.4387 1270.2618 1273.2545 1282.1783 1295.8324 1309.8537 1318.5599 1325.1416 1339.8378 1345.5075 1349.8180 1355.7388 1365.5198 1382.4863 1393.7498 1455.3845 1456.9084 1458.6641 1464.3301 1468.2579 1475.0244 1475.9327 1477.3889 1480.2972 1642.8159 2800.2641 2811.2232 2832.8152 2955.3465 2966.2687 2966.7597 2979.2239 2984.9940 2987.8693 2996.7126 3011.6789 3019.8004 3026.3902 3040.7160 3048.5039 3060.5411 3066.0683 3066.8803 3446.5294 3572.1940
redmass: 3.0253 3.6496 1.8088 2.4386 2.5512 2.3216 1.1048 1.6672 1.6102 1.5993 2.2612 2.3069 2.4118 3.0449 2.1273 2.7760 2.0958 2.2326 1.6191 1.6432 1.5934 2.3546 1.6052 1.5820 1.5010 2.0947 1.7278 1.5659 1.5514 1.5785 1.5980 2.2566 2.4718 3.0234 2.5456 1.8599 2.5173 1.6843 1.3583 2.4711 2.1941 1.3094 1.4153 1.2295 1.2563 1.3685 1.3073 1.2532 1.3021 1.1924 1.3870 1.4697 1.4504 1.4248 1.4269 1.2638 1.3837 1.0835 1.0881 1.0796 1.0916 1.0792 1.0542 1.0903 1.0591 1.0918 1.0896 1.0707 1.0711 1.0698 1.0627 1.0415 1.0549 1.0806 1.0622 1.0679 1.0881 1.0887 1.0945 1.0973 1.0871 1.1027 1.0989 1.1011 1.0991 1.0445 1.0971
irintensity: 0.7184 0.4472 2.8380 0.1124 0.3591 2.7823 0.3553 21.8259 17.1324 17.5040 8.3808 0.7569 6.4186 0.5377 3.1410 3.4366 10.4698 6.0997 296.8359 8.5143 2.2718 0.9712 10.8186 5.6139 4.2826 1.6030 4.4613 3.2102 13.7083 4.6145 11.5853 13.6368 10.8789 2.5643 19.9252 11.9639 25.2221 4.1064 8.3229 22.7948 9.2976 4.6273 6.2305 9.9409 1.5194 2.3055 1.8929 4.6019 3.6183 6.4742 5.3600 0.9574 0.9724 6.1937 2.6675 15.3119 1.3397 10.0536 7.0276 0.2685 3.1126 6.1947 4.5280 15.2550 10.8559 16.1790 32.4873 50.7176 63.5724 212.4910 26.7889 62.3263 18.3376 32.7461 27.6689 47.2736 4.1558 28.2966 81.1138 36.7114 57.1834 46.0228 76.1698 38.2351 56.1350 1.5984 0.0436
temp: 298.150 k
press: 1.00000 atm
elementType: 7 7 6 6 6 6 6 6 6 6 6 1 1 1 1 1 1 1 1 1 1 1 1 1 1 1 1 1 1 1 1
symmnumber: 1
zpe: 742343.9 jmol-1
zpe.correction: 0.282744 hartree
zpe.thermalcorrener: 0.295544 hartree
zpe.thermalcorrenthalpy: 0.296488 hartree
zpe.thermalcorrgfe: 0.243373 hartree
zpe.sumelectzpe: -463.512556 hartree
zpe.sumelectthermal: -463.499756 hartree
zpe.sumelectthermalent: -463.498812 hartree
zpe.sumelectthermalfe: -463.551927 hartree
dipole: 0.4871 0.2780 1.9476
dipole: 2.0268
quadrupole: -69.9099 -67.2574 -75.3709
quadrupole: -0.6549 -7.7168 -0.3525
quadrupole: 0.9361 3.5887 -4.5248 -0.6549 -7.7168 -0.3525
hfenergy: -463.7952996 hartree
pointgroup: C01 [X(C9H20N2)]
dipole: -0.1919273 0.0285784 -0.7734256 debye
polarizability: 129.8743601|0.8011757|105.810192|-2.9885813|-0.2517875|94.2818583 unknown
InChI: InChI=1S/C9H20N2/c1-9-4-2-6-11(8-9)7-3-5-10/h9H,2-8,10H2,1H3
charge 0 multiplicity 1
31 atoms
N  0.053723 -0.224975 -0.29132
N  4.300953 0.2967 0.99041
C  -2.290133 -0.294062 0.614611
C  -1.200276 -1.015172 -0.211505
C  -2.550771 1.109823 0.015085
C  -1.232978 1.903451 -0.120917
C  -0.188608 1.097382 -0.919035
C  1.141694 -0.990923 -0.954245
C  -3.57996 -1.137665 0.680738
C  2.547809 -0.383568 -0.7503
C  2.960729 -0.274467 0.742671
H  -1.88823 -0.161083 1.640254
H  -0.964356 -1.990654 0.256017
H  -1.613931 -1.229709 -1.235938
H  -3.276162 1.663071 0.642801
H  -3.015816 0.991074 -0.987141
H  -1.412859 2.872879 -0.624982
H  -0.822515 2.118719 0.884743
H  -0.545339 0.977266 -1.978711
H  0.763263 1.656122 -0.957108
H  0.945003 -1.109037 -2.053092
H  1.134829 -2.010591 -0.519535
H  -3.39356 -2.12883 1.135706
H  -4.355099 -0.629379 1.28398
H  -3.996623 -1.30245 -0.332044
H  2.615975 0.617963 -1.22152
H  3.279783 -1.024205 -1.28531
H  2.922709 -1.281984 1.202507
H  2.211962 0.334393 1.279306
H  4.379724 1.291166 0.753817
H  5.068361 -0.246658 0.580757
