program: Gaussian 09
title: 000033079
version: EM64L-G09RevD.01
frameworkgroup: C1[X(C13H17N3O)]
method: RPBEPBE
basis: SDD
operation: Freq
keyword: #p
keyword: freq=noraman
keyword: PBEPBE/SDD
title: #p freq=noraman PBEPBE/SDD
converged: YES YES NO NO
title: Mulliken charges:
elementType: O N N N C C C C C C C C C C C C C H H H H H H H H H H H H H H H H H
charge: -0.256066 -0.073476 -0.101849 0.019888 -0.361708 -0.371633 -0.350306 -0.355825 -0.614614 -0.363563 0.081330 0.264602 -0.326322 -0.344267 -0.242328 -0.235445 -0.230329 0.217690 0.196455 0.195936 0.221243 0.232277 0.226280 0.239363 0.221287 0.193154 0.227545 0.227884 0.222349 0.286138 0.278122 0.222090 0.227200 0.226901
chargesum: 0.00000
title: Mulliken charges with hydrogens summed into heavy atoms:
elementType: O N N N C C C C C C C C C C C C C
charge: -0.256066 -0.073476 -0.101849 0.019888 0.052437 0.045546 0.108250 0.104824 0.033968 -0.141214 0.081330 0.264602 -0.040185 -0.066145 -0.020237 -0.008245 -0.003428
polarizability: 2.78922461e+02 5.52407728e+00 1.75566173e+02 5.58619028e+00 1.99543484e+00 8.88277087e+01
1716.lowfreq: -14.3420 -0.0001 0.0003 0.0006 3.6595 4.6362 18.6287 34.1041 41.9985
frequency: 15.4073 33.9052 41.8804 61.5114 129.4553 158.4346 162.8706 194.8658 204.9011 221.2136 239.7217 269.3425 312.4507 342.3776 360.0686 385.0346 403.2324 409.4317 444.4625 454.9637 481.6273 552.0458 610.8643 616.7130 650.5851 680.3013 703.8663 738.9209 761.4543 786.1755 797.3808 837.5749 868.3689 895.5971 936.8193 960.6733 989.6962 990.4838 1003.2183 1010.3256 1020.7035 1027.7290 1048.8440 1068.8942 1072.2781 1077.3055 1088.5720 1119.1396 1147.5644 1158.2257 1162.4745 1170.4279 1187.1122 1197.3792 1241.3922 1278.7664 1288.5892 1300.3093 1308.9581 1313.1993 1339.0762 1350.4047 1364.5248 1372.9493 1382.7373 1383.6599 1432.4556 1434.2244 1451.0185 1457.1830 1457.8068 1464.2654 1475.5975 1476.2547 1482.3953 1506.6578 1536.7867 1587.7958 1608.6188 2849.1143 2855.9569 2875.1133 2958.5373 2962.2926 3026.1865 3038.4488 3045.2879 3052.5617 3066.3081 3083.4558 3088.7529 3121.4960 3134.7138 3150.1676 3163.0375 3181.1202
redmass: 3.4762 3.7240 4.1572 4.9666 4.8773 4.4855 4.0408 3.2487 1.4833 4.2199 1.4551 2.6781 3.3727 2.6017 4.1086 2.0344 2.8814 5.9340 3.7547 4.9890 2.9819 4.7078 3.3742 5.8113 3.6206 4.3382 1.5632 4.5955 3.7237 3.8004 2.0729 1.5603 1.2464 1.6020 1.9952 1.4295 2.8225 4.9581 1.3710 1.3261 2.7205 2.2871 1.6621 1.7365 1.9083 1.6518 2.4135 1.4905 2.5892 3.0590 2.1459 1.0607 1.1638 1.0751 3.2087 1.6461 1.5499 2.2999 1.3968 1.3444 1.2854 1.3978 1.3683 2.0327 2.0740 4.3945 2.3511 1.1754 1.0853 1.1015 1.0764 1.0573 2.0688 1.1671 1.0531 7.4448 5.1723 6.3586 6.0679 1.0712 1.0674 1.0585 1.0662 1.0676 1.0743 1.0884 1.0899 1.0887 1.0923 1.1011 1.0941 1.0851 1.0896 1.0944 1.0982 1.0951
irintensity: 0.0547 0.2150 2.6037 1.1088 2.7990 1.4274 3.5861 2.4497 1.7285 2.0203 1.4270 24.0054 2.8790 3.9623 9.6963 6.7873 0.0377 6.8082 2.4532 0.7807 2.3579 3.0379 4.3058 2.7686 45.6076 5.4440 73.2091 4.7780 18.0573 19.3041 40.3361 4.3194 0.3055 33.9796 1.1540 3.9809 96.5665 20.5448 0.0408 1.0473 31.9833 6.8006 2.2712 6.2374 24.7401 26.4951 10.1105 53.9749 94.1937 19.3195 110.9025 0.5785 13.9163 2.3555 2.7692 14.2841 18.5393 242.6156 153.7624 4.9055 32.2906 5.7304 9.4259 20.9851 21.4737 0.4683 10.4362 2.2987 13.9157 67.4309 0.8165 19.8746 1.8360 12.5360 9.9210 110.3774 332.0819 20.2221 7.5382 49.2974 51.4047 212.1868 17.6303 72.0597 45.4250 41.4504 44.2497 29.5466 24.3851 30.0572 15.4455 0.3986 20.6536 17.3348 27.2840 21.5778
temp: 298.150 k
press: 1.00000 atm
elementType: 8 7 7 7 6 6 6 6 6 6 6 6 6 6 6 6 6 1 1 1 1 1 1 1 1 1 1 1 1 1 1 1 1 1
symmnumber: 1
zpe: 736977.7 jmol-1
zpe.correction: 0.280700 hartree
zpe.thermalcorrener: 0.296502 hartree
zpe.thermalcorrenthalpy: 0.297446 hartree
zpe.thermalcorrgfe: 0.235550 hartree
zpe.sumelectzpe: -743.736711 hartree
zpe.sumelectthermal: -743.720908 hartree
zpe.sumelectthermalent: -743.719964 hartree
zpe.sumelectthermalfe: -743.781861 hartree
dipole: -5.5012 -3.1157 0.4051
dipole: 6.3352
quadrupole: -83.9429 -101.7537 -105.4565
quadrupole: -9.8611 -2.3095 0.2977
quadrupole: 13.1081 -4.7027 -8.4055 -9.8611 -2.3095 0.2977
hfenergy: -744.0174105 hartree
pointgroup: C01 [X(C13H17N3O1)]
dipole: 2.218414 0.2286244 1.1129716 debye
polarizability: 278.0098648|15.8737361|95.5085021|-2.6323182|21.0055583|169.7979758 unknown
InChI: InChI=1S/C13H17N3O/c1-15-7-9-16(10-8-15)14-11-13(17)12-5-3-2-4-6-12/h2-6,11H,7-10H2,1H3
charge 0 multiplicity 1
34 atoms
O  -2.250489 -0.521046 -2.640466
N  4.594112 0.638349 -0.12559
N  1.752568 0.391724 -0.378751
N  0.396397 0.306303 -0.370813
C  3.749345 0.544642 1.087748
C  4.017366 -0.185521 -1.210418
C  2.341416 1.083057 0.787165
C  2.605124 0.301805 -1.588597
C  6.010569 0.315118 0.137561
C  -0.292401 -0.021628 -1.459669
C  -1.761206 -0.192988 -1.500816
C  -2.68787 -0.008524 -0.324514
C  -2.276274 0.39448 0.975917
C  -4.069975 -0.255131 -0.561196
C  -3.228861 0.546161 2.007491
C  -5.016902 -0.105086 0.470205
C  -4.599011 0.297667 1.761792
H  4.201698 1.156817 1.88899
H  3.674471 -0.509786 1.459005
H  3.959627 -1.266584 -0.920351
H  4.665706 -0.110016 -2.102522
H  1.66224 0.925805 1.640508
H  2.408756 2.172112 0.581228
H  2.66287 1.294352 -2.083489
H  2.161145 -0.41733 -2.298095
H  6.169413 -0.737588 0.481697
H  6.406143 0.993099 0.914383
H  6.60341 0.468214 -0.78161
H  0.163956 -0.201959 -2.446835
H  -1.217307 0.582783 1.162686
H  -4.367618 -0.561921 -1.569437
H  -2.901721 0.858685 3.005963
H  -6.076985 -0.299502 0.272044
H  -5.333911 0.416439 2.566487
