program: Gaussian 09
title: 000033353
version: EM64L-G09RevD.01
frameworkgroup: C1[X(C22H22F3NO6)]
method: RPBEPBE
basis: SDD
operation: Freq
keyword: #p
keyword: freq=noraman
keyword: PBEPBE/SDD
title: #p freq=noraman PBEPBE/SDD
converged: YES YES NO NO
title: Mulliken charges:
elementType: F F F O O O O O O N C C C C C C C C C C C C C C C C C C C C C C H H H H H H H H H H H H H H H H H H H H H H
charge: -0.181175 -0.151891 -0.135134 -0.306243 -0.308666 -0.281607 -0.265503 -0.279480 -0.203247 -0.369857 -0.356544 -0.433174 -0.637889 0.514760 0.443937 0.002559 0.353472 0.103116 -0.649724 -0.559203 -0.321119 0.017694 0.226216 0.059181 0.135144 -0.353456 0.216393 0.307430 -0.526451 -0.523195 -0.522055 -0.499497 0.280305 0.235239 0.236641 0.242877 0.235625 0.378353 0.270376 0.237576 0.241037 0.239588 0.234347 0.256658 0.232447 0.231035 0.255127 0.231019 0.265603 0.221006 0.231854 0.275302 0.229152 0.224041
chargesum: 0.00000
title: Mulliken charges with hydrogens summed into heavy atoms:
elementType: F F F O O O O O O N C C C C C C C C C C C C C C C C C C C C C C
charge: -0.181175 -0.151891 -0.135134 -0.306243 -0.308666 -0.281607 -0.265503 -0.279480 -0.203247 0.008496 -0.076239 0.038706 -0.159387 0.514760 0.443937 0.002559 0.353472 0.103116 -0.379348 -0.321627 -0.080082 0.017694 0.226216 0.059181 0.135144 -0.113868 0.216393 0.307430 0.197001 0.193985 0.196409 0.228998
polarizability: 4.40384892e+02 1.97000730e+01 2.41302129e+02 -2.14403905e+01 2.38313393e+01 2.27417350e+02
1716.lowfreq: -8.9805 -5.8079 -0.0009 -0.0006 -0.0004 4.3377 16.7187 18.3671 24.6028
frequency: 16.5912 18.2582 24.5307 27.6449 30.5598 35.8913 46.9624 53.7978 67.7876 71.7991 79.5943 90.8710 102.5596 125.1294 129.0210 133.0501 150.8607 158.3012 165.6334 170.0781 174.0092 183.9837 208.2315 217.4415 222.0064 241.9107 257.0120 265.7349 269.1515 277.9271 299.5973 323.9049 329.1171 348.6077 358.3369 373.8596 380.4722 388.2141 392.4075 404.3496 409.1680 436.5891 445.8352 465.1023 475.2831 511.5621 529.3399 535.7846 557.4273 576.6577 604.1246 622.2719 627.6290 634.2500 650.7628 672.6158 685.1776 704.1695 720.7176 733.8590 744.4780 766.5893 787.8888 790.4245 825.5009 847.0063 858.2413 867.1104 882.1704 901.8999 906.6904 921.4679 925.1710 951.3121 971.2577 975.4942 994.2935 1004.9608 1030.7865 1038.0295 1060.4528 1073.2127 1086.1481 1100.7072 1104.0275 1107.7952 1111.2285 1113.2180 1125.2281 1128.3258 1151.6391 1154.2820 1155.5522 1158.3378 1174.7981 1201.3932 1218.5890 1235.3942 1241.1598 1250.7887 1272.6686 1281.5730 1303.9229 1327.8309 1331.3690 1339.6594 1346.4240 1368.8118 1381.6579 1390.2681 1416.1393 1428.8483 1431.3988 1435.9868 1443.9487 1448.2825 1450.7883 1456.5466 1459.6360 1461.2592 1462.4177 1465.6253 1473.6445 1474.4002 1481.3914 1481.7552 1484.6911 1489.2257 1525.3262 1544.3971 1576.2012 1590.6754 1604.9568 1652.0331 2979.9661 2982.0163 2984.8810 2991.3091 2998.0338 3010.3850 3046.4498 3054.1296 3065.1589 3082.0011 3087.8589 3091.2669 3102.3894 3118.5071 3118.8285 3124.7548 3129.1908 3134.9630 3148.0602 3154.1312 3155.3404 3521.8042
redmass: 8.8915 8.1800 12.0352 5.5584 11.1078 5.7258 3.4576 3.1854 2.6017 2.3302 3.0947 2.8354 3.2375 1.8673 2.0387 3.1694 3.5644 1.8248 1.3906 1.3684 2.9278 3.9901 5.3984 5.3561 3.7296 5.2033 4.5357 5.8063 5.7680 7.6242 4.4061 5.4210 4.5062 5.3146 4.5938 9.8816 5.0877 5.5176 5.6022 5.4587 4.6801 5.7873 10.9126 6.9941 5.8669 5.1429 6.2395 5.7823 5.3188 3.7450 5.5980 3.2045 7.2659 1.6419 4.1714 5.7229 6.7561 6.6184 5.0717 3.5891 5.2089 5.9890 5.6689 4.8720 3.4072 3.5539 1.5106 5.3617 1.8006 3.8455 2.7483 7.8945 1.9585 7.5246 3.2278 1.3995 4.1362 7.8958 7.1062 6.4457 3.1017 2.6945 3.9073 1.3014 2.0105 1.3800 1.2496 1.2865 3.4427 3.6963 1.3505 1.6364 1.5022 1.5003 1.3488 1.9911 1.6139 4.3838 2.4902 2.1826 1.6883 1.4752 3.0973 1.6198 1.3791 2.6487 2.3756 1.9796 2.0376 1.7115 1.3256 1.4011 1.2273 1.3141 1.7616 1.4127 1.4344 1.0879 1.0735 1.2571 1.3358 1.0749 1.1092 1.0895 1.1062 1.6660 1.0545 3.1988 4.4380 7.9194 4.7719 7.3481 7.4803 10.5333 1.0299 1.0336 1.0298 1.0598 1.0635 1.0297 1.0939 1.0916 1.1028 1.1049 1.1052 1.0985 1.0871 1.0976 1.0929 1.1033 1.1035 1.1051 1.0909 1.0918 1.1045 1.0778
irintensity: 2.0517 2.1502 0.7575 1.6235 2.5935 0.4221 1.6208 3.5710 1.4741 3.7768 4.5186 6.3334 4.0867 2.5051 0.7714 0.4401 3.2617 3.5581 0.9479 1.0794 0.3611 3.5878 3.8053 7.0584 7.2984 4.1224 11.2812 4.4010 12.3245 2.0610 10.2843 1.1738 3.0400 0.5650 6.8624 1.2525 3.6268 5.9327 1.0738 1.1483 10.2507 4.4382 8.8562 13.8244 16.5184 4.1775 6.2058 2.3578 5.7102 8.1181 2.0908 15.4063 12.5141 50.8523 36.1787 5.3302 2.6627 3.3265 34.2115 3.1136 10.9090 6.9564 3.9543 10.2694 13.8661 9.8245 20.0232 5.9180 39.9241 36.0343 17.9468 26.7875 8.7635 38.0212 15.4095 3.0669 140.2388 117.8979 109.5828 199.2898 43.8117 27.7834 28.1901 17.8241 42.3695 20.8768 15.2308 2.5495 113.7885 92.8030 2.5377 33.8295 12.8192 19.1273 23.1218 34.4313 147.8529 354.6804 17.8476 12.2455 25.1098 2.1758 129.8870 19.7994 2.5288 6.1489 92.6634 53.8664 23.0142 6.7341 9.7711 69.2793 78.3682 11.2946 72.1970 3.0906 71.8518 14.5403 2.9575 100.4203 13.0503 5.5152 19.8526 9.0229 41.3883 136.4913 34.2507 188.9364 83.8063 32.9831 30.0022 26.7258 102.5134 271.2145 72.7954 80.1488 48.1674 26.4353 24.8877 84.1538 5.3518 20.4464 27.6228 20.6423 20.2983 32.0206 2.8084 40.7380 4.1167 21.3289 15.9750 15.4643 5.1064 3.3363 10.7436 77.0256
temp: 298.150 k
press: 1.00000 atm
elementType: 9 9 9 8 8 8 8 8 8 7 6 6 6 6 6 6 6 6 6 6 6 6 6 6 6 6 6 6 6 6 6 6 1 1 1 1 1 1 1 1 1 1 1 1 1 1 1 1 1 1 1 1 1 1
symmnumber: 1
zpe: 1060619.7 jmol-1
zpe.correction: 0.403969 hartree
zpe.thermalcorrener: 0.436224 hartree
zpe.thermalcorrenthalpy: 0.437168 hartree
zpe.thermalcorrgfe: 0.336781 hartree
zpe.sumelectzpe: -1654.714193 hartree
zpe.sumelectthermal: -1654.681938 hartree
zpe.sumelectthermalent: -1654.680994 hartree
zpe.sumelectthermalfe: -1654.781381 hartree
dipole: -2.8605 -5.7422 2.0610
dipole: 6.7382
quadrupole: -179.9112 -199.3601 -174.2634
quadrupole: -8.5220 8.2911 14.7315
quadrupole: 4.6004 -14.8485 10.2481 -8.5220 8.2911 14.7315
hfenergy: -1655.1181621 hartree
pointgroup: C01 [X(C22H22F3N1O6)]
dipole: 1.2495895 -2.2769909 -0.5306958 debye
polarizability: 443.2490495|-12.031024|235.6638557|-5.2529118|-26.2268254|230.1914667 unknown
InChI: InChI=1S/C22H22F3NO6/c1-29-16-8-6-12-13(10-15(16)27)14(26-21(28)22(23,24)25)7-5-11-9-17(30-2)19(31-3)20(32-4)18(11)12/h6,8-10,14,26H,5,7H2,1-4H3
charge 0 multiplicity 1
54 atoms
F  2.539851 2.482925 0.503955
F  1.127103 3.261866 2.103885
F  1.930374 4.672311 0.521418
O  0.681123 -1.482861 1.800766
O  3.476389 -1.848048 1.537354
O  4.678906 -1.532097 -1.093245
O  -5.391481 -1.904056 0.53078
O  -5.304144 0.78175 -0.431462
O  -0.778464 3.848695 -0.145245
N  0.334218 1.905717 -0.872552
C  -0.764921 1.405856 -1.734613
C  -0.220428 0.900554 -3.103088
C  0.266831 -0.57531 -3.094671
C  -1.649051 0.353229 -1.018357
C  1.108382 -0.901117 -1.872564
C  0.470558 -1.010171 -0.59474
C  -1.013021 -0.825953 -0.458934
C  1.285944 -1.313679 0.535697
C  2.506845 -1.044028 -1.981651
C  -3.004963 0.683192 -0.986258
C  -1.704884 -1.852003 0.208337
C  2.691643 -1.506749 0.411728
C  3.313317 -1.33428 -0.855456
C  -4.219376 0.084493 -0.429594
C  0.20651 3.063929 -0.155112
C  -3.087085 -2.060258 0.450009
C  -4.215269 -1.288206 0.141449
C  1.445831 3.377441 0.734227
C  1.042714 -0.458427 2.815606
C  3.233559 -3.219346 2.053295
C  5.643901 -0.846236 -0.200314
C  -6.738697 -1.492685 0.058499
H  -1.391079 2.293814 -1.925171
H  -1.02796 1.00387 -3.851775
H  0.599002 1.576595 -3.413971
H  -0.618018 -1.239094 -3.117885
H  0.840333 -0.767746 -4.018602
H  1.188582 1.347769 -0.790973
H  3.00365 -0.949833 -2.952476
H  -3.266415 1.660189 -1.418433
H  -1.071028 -2.662416 0.583996
H  -3.338299 -3.004561 0.950179
H  0.648084 0.528995 2.51486
H  2.137771 -0.41347 2.946583
H  0.554203 -0.787703 3.744724
H  3.483585 -3.96505 1.276366
H  2.181624 -3.329561 2.369807
H  3.908465 -3.330077 2.915511
H  5.491846 -1.145267 0.848573
H  5.534964 0.25022 -0.302848
H  6.633862 -1.160817 -0.562774
H  -7.014075 -0.512698 0.469444
H  -6.766867 -1.445654 -1.042972
H  -7.390743 -2.298653 0.42969
