program: Gaussian 09
title: 000033076
version: EM64L-G09RevD.01
frameworkgroup: C1[X(C18H18N2O2)]
method: RPBEPBE
basis: SDD
operation: Freq
keyword: #p
keyword: freq=noraman
keyword: PBEPBE/SDD
title: #p freq=noraman PBEPBE/SDD
converged: YES YES NO NO
title: Mulliken charges:
elementType: O O N N C C C C C C C C C C C C C C C C C C H H H H H H H H H H H H H H H H H H
charge: -0.245173 -0.251299 -0.113991 0.020533 -0.336147 -0.344064 -0.299773 -0.310178 0.362580 0.275942 -0.369124 0.336129 0.071703 -0.410545 -0.404763 -0.330234 -0.370386 -0.392516 -0.392549 -0.236288 -0.236536 -0.240266 0.237528 0.230488 0.242743 0.227645 0.226658 0.202529 0.201104 0.229891 0.223673 0.234748 0.238898 0.282259 0.276796 0.240878 0.238767 0.226625 0.225610 0.230104
chargesum: 0.00000
title: Mulliken charges with hydrogens summed into heavy atoms:
elementType: O O N N C C C C C C C C C C C C C C C C C C
charge: -0.245173 -0.251299 -0.113991 0.020533 0.131868 0.126324 0.129415 0.120817 0.362580 0.275942 -0.145451 0.336129 0.071703 -0.175796 -0.165864 -0.047975 -0.093590 -0.151638 -0.153783 -0.009663 -0.010926 -0.010161
polarizability: 3.99900726e+02 -1.15101864e+01 2.39669978e+02 8.18511386e+00 1.01745975e+01 1.10500772e+02
1716.lowfreq: -6.3631 -0.0007 -0.0002 0.0004 2.2771 4.8659 12.1008 27.8714 37.1271
frequency: 11.8149 27.6804 37.0618 51.1263 59.2651 71.4338 99.7506 140.9126 160.2012 175.8272 206.5618 217.8020 251.0802 267.6785 291.5495 330.9329 363.4790 378.2429 396.0653 404.3852 410.2611 453.6648 459.1920 469.2763 484.1284 545.8747 552.9838 604.7263 614.0478 632.9988 645.7494 682.1750 700.5507 701.5948 750.1958 762.4186 781.5533 787.0083 808.4330 833.4460 850.1781 858.1812 867.6832 898.2876 915.0491 922.5381 974.2177 987.8299 992.5121 993.8779 994.2356 996.8000 1001.3987 1010.6112 1016.6721 1039.5435 1051.4130 1076.6958 1083.2301 1085.3176 1099.4717 1119.5919 1148.3239 1173.7202 1176.2570 1190.3802 1193.3515 1203.3585 1258.4840 1277.0535 1289.0404 1293.5030 1304.7346 1305.6126 1313.0338 1332.9483 1343.2969 1355.0934 1358.4920 1367.0340 1376.0528 1378.2288 1416.8778 1437.0821 1448.4556 1450.1553 1454.9304 1459.9714 1474.8701 1500.7089 1511.5325 1536.4115 1565.0995 1587.1489 1611.7282 1616.9467 2951.7425 2954.8063 2961.2123 2966.0929 3051.8405 3061.1932 3083.1469 3089.9661 3095.2860 3123.5407 3128.1362 3133.0365 3133.7341 3142.3592 3150.4729 3159.7503 3165.6151 3180.8201
redmass: 3.6828 3.4554 5.5512 5.1340 6.1476 3.8116 5.2820 5.4032 5.4559 4.2698 2.1442 4.7590 3.2239 6.5353 4.1216 4.9728 4.3022 2.0214 4.5897 2.8501 2.9126 6.4079 3.4615 4.7655 3.7542 3.1909 3.8704 3.1475 6.5317 5.6398 4.4132 3.5828 4.2316 1.8285 2.3576 5.0394 2.5634 4.7234 3.8402 1.6291 1.2506 1.2729 1.5601 1.6600 2.3255 1.4684 1.4439 4.5862 1.9244 1.7298 1.3204 6.3453 1.3917 2.4745 2.9221 1.9534 1.9232 3.9074 3.1219 1.6342 2.2499 1.3799 2.2725 1.0530 2.7510 1.1209 1.0693 1.1557 1.4960 1.2989 2.5115 1.9610 1.3981 1.6909 1.4337 1.2701 1.2889 2.5665 1.3943 2.0748 7.9231 1.5615 4.2169 2.3921 1.0795 1.0825 1.1018 1.0988 2.1772 7.7954 2.8396 5.4909 6.2372 6.3923 6.0042 6.3007 1.0694 1.0699 1.0644 1.0655 1.0903 1.0908 1.0938 1.0965 1.0978 1.0844 1.0878 1.0881 1.0894 1.0917 1.0963 1.0953 1.1016 1.0942
irintensity: 0.0245 0.2648 0.8314 1.8004 1.2874 0.4406 1.2953 0.6122 1.1511 4.8787 4.5382 2.9284 29.7382 2.6923 1.0056 0.6224 20.5196 2.5087 11.3477 0.3787 0.8385 6.4416 1.3758 3.0534 11.3941 6.4457 4.9867 7.2364 0.4754 14.5389 14.8983 6.8079 61.3771 43.2245 55.2588 3.2951 30.1034 39.3951 17.3663 8.1009 0.9599 3.4363 56.8082 20.0419 4.6002 1.4998 0.6812 0.9491 59.2682 60.8543 0.4122 5.4389 1.2136 20.3855 0.4567 6.0763 21.1841 26.8248 95.0698 2.9494 31.1005 6.3327 185.9662 0.0462 19.3175 2.0256 0.2057 35.3645 6.8820 4.9164 24.8266 67.8824 34.9808 344.6614 9.4804 34.0338 10.6022 2.7035 11.3825 38.6897 1.9723 21.8722 16.0991 11.2935 9.7490 2.4875 65.1885 7.0537 10.8214 164.7779 7.8854 282.6662 80.3259 1.2233 1.6389 71.3430 48.7046 38.8919 20.4855 108.9874 27.6152 40.5809 16.4779 28.9132 33.9513 6.6513 4.2490 5.2045 12.0272 13.2200 39.2601 7.4847 31.3321 11.2303
temp: 298.150 k
press: 1.00000 atm
elementType: 8 8 7 7 6 6 6 6 6 6 6 6 6 6 6 6 6 6 6 6 6 6 1 1 1 1 1 1 1 1 1 1 1 1 1 1 1 1 1 1
symmnumber: 1
zpe: 841579.7 jmol-1
zpe.correction: 0.320541 hartree
zpe.thermalcorrener: 0.339537 hartree
zpe.thermalcorrenthalpy: 0.340481 hartree
zpe.thermalcorrgfe: 0.270134 hartree
zpe.sumelectzpe: -955.041035 hartree
zpe.sumelectthermal: -955.022039 hartree
zpe.sumelectthermalent: -955.021095 hartree
zpe.sumelectthermalfe: -955.091442 hartree
dipole: -1.6090 -3.7678 0.5673
dipole: 4.1360
quadrupole: -104.9169 -132.9530 -131.6902
quadrupole: -2.5341 -1.5298 3.1453
quadrupole: 18.2698 -9.7663 -8.5035 -2.5341 -1.5298 3.1453
hfenergy: -955.3615758 hartree
pointgroup: C01 [X(C18H18N2O2)]
dipole: -0.6420165 -1.3593634 0.6227537 debye
polarizability: 394.5330093|2.3826673|232.1714375|41.9851476|-30.5168822|123.3670296 unknown
InChI: InChI=1S/C18H18N2O2/c21-18(14-19-20-10-12-22-13-11-20)17-8-6-16(7-9-17)15-4-2-1-3-5-15/h1-9,14H,10-13H2
charge 0 multiplicity 1
40 atoms
O  -6.474135 -1.977819 -0.169388
O  -1.269966 3.099053 -1.496909
N  -3.988358 -0.569087 -0.428686
N  -2.746759 -0.019488 -0.535395
C  -4.006709 -2.043941 -0.3219
C  -5.242812 0.06948 -0.900576
C  -5.249448 -2.505504 0.456035
C  -6.447602 -0.510693 -0.128785
C  2.655316 0.291971 0.097538
C  0.058107 1.284652 -0.628433
C  -2.570177 1.233402 -0.939384
C  4.001154 -0.222897 0.47697
C  -1.252369 1.903589 -1.032015
C  1.482201 -0.482927 0.312823
C  2.498663 1.579248 -0.492015
C  0.206965 -0.002417 -0.041891
C  1.229281 2.064106 -0.845368
C  5.022935 0.661102 0.923941
C  4.3027 -1.611644 0.402134
C  6.297814 0.175404 1.283582
C  5.577378 -2.098773 0.760656
C  6.582592 -1.207733 1.203822
H  -3.078183 -2.353882 0.185319
H  -4.020509 -2.495609 -1.336703
H  -5.363717 -0.09189 -1.993217
H  -5.199037 1.157121 -0.714222
H  -5.345243 -3.602418 0.425081
H  -5.19015 -2.16533 1.512269
H  -6.412104 -0.16473 0.926806
H  -7.39138 -0.180149 -0.591537
H  -3.387266 1.899017 -1.263365
H  1.567034 -1.463283 0.795506
H  3.384797 2.188716 -0.701888
H  -0.681723 -0.610451 0.137221
H  1.107323 3.051167 -1.303455
H  4.807029 1.731104 1.020016
H  3.544057 -2.309328 0.029808
H  7.065909 0.873988 1.634014
H  5.79002 -3.17115 0.685297
H  7.572671 -1.585379 1.482196
