program: Gaussian 09
title: 000033086
version: EM64L-G09RevD.01
frameworkgroup: C1[X(C13H16ClN3O)]
method: RPBEPBE
basis: SDD
operation: Freq
keyword: #p
keyword: freq=noraman
keyword: PBEPBE/SDD
title: #p freq=noraman PBEPBE/SDD
converged: YES YES NO NO
title: Mulliken charges:
elementType: Cl O N N N C C C C C C C C C C C C C H H H H H H H H H H H H H H H H
charge: -0.060215 -0.252812 -0.073705 -0.100833 0.016370 -0.361825 -0.371859 -0.349668 -0.355153 -0.614449 -0.362003 0.080955 0.277675 -0.306108 -0.334858 -0.226754 -0.226345 -0.095555 0.219269 0.196986 0.196465 0.222626 0.231485 0.228753 0.241070 0.221675 0.193803 0.228284 0.228421 0.225141 0.291287 0.284245 0.251398 0.256233
chargesum: 0.00000
title: Mulliken charges with hydrogens summed into heavy atoms:
elementType: Cl O N N N C C C C C C C C C C C C C
charge: -0.060215 -0.252812 -0.073705 -0.100833 0.016370 0.054430 0.047232 0.110571 0.107592 0.036058 -0.136862 0.080955 0.277675 -0.014821 -0.050614 0.024644 0.029888 -0.095555
polarizability: 3.05789990e+02 3.58806321e+00 1.92054711e+02 4.05960327e+00 3.13228318e+00 9.11549024e+01
1716.lowfreq: -7.5303 -1.5580 -0.0023 -0.0014 -0.0007 6.0345 15.8579 22.5970 40.3550
frequency: 15.1514 22.2308 40.3043 52.0532 89.1443 131.6300 144.0240 181.5303 187.4782 204.5019 239.3078 259.5431 268.5081 294.2212 303.5316 327.7136 348.8215 378.6660 388.9798 409.6740 454.7170 473.4047 475.6925 504.8248 556.3480 620.4517 626.2887 664.5490 672.2415 743.1947 744.4597 764.9957 786.8959 837.1880 841.7585 854.2292 894.9213 937.7446 989.3583 991.2183 997.0171 999.7362 1025.4708 1048.3470 1068.9640 1070.1738 1072.9467 1084.4965 1104.7783 1118.7077 1149.0366 1159.2434 1163.6436 1182.9633 1198.0107 1241.2978 1278.7017 1288.0797 1290.9736 1301.3815 1307.9290 1338.9965 1349.5099 1364.3457 1366.3596 1373.8482 1382.9244 1396.3129 1433.9316 1450.9776 1456.7416 1457.2022 1464.2912 1470.7886 1476.1848 1482.6711 1504.4975 1535.6228 1580.7845 1593.1830 2849.9708 2856.5503 2875.8444 2961.4425 2965.1024 3026.8014 3040.2198 3045.3820 3057.5143 3068.3359 3083.9655 3089.3830 3153.3850 3161.1251 3173.5072 3183.8446
redmass: 3.3749 3.8154 4.1692 6.1300 10.0096 4.6282 4.8439 6.7762 3.4967 1.5031 1.3752 4.9641 2.7225 4.8299 10.2367 3.0836 3.1050 2.5607 2.8870 2.9625 5.5138 3.3865 3.5130 5.2470 4.6089 3.6183 4.3521 4.3802 4.4150 4.2435 3.6830 4.0723 3.7931 1.5633 1.2508 1.5275 1.6392 1.9965 1.4469 2.2703 1.3539 4.4412 2.4473 1.6692 3.0538 1.8112 1.9228 2.5059 1.3484 1.4839 2.5752 3.1226 2.0483 1.1972 1.0750 3.1529 1.6499 1.5099 1.2837 2.3750 1.3761 1.2826 1.3971 1.3682 4.0979 2.1936 1.8190 4.0220 1.1702 1.0868 1.1001 1.0769 1.0587 2.4439 1.1077 1.0522 8.5826 5.2053 7.8213 6.2840 1.0715 1.0673 1.0582 1.0658 1.0674 1.0744 1.0881 1.0901 1.0916 1.0904 1.1011 1.0943 1.0884 1.0899 1.0964 1.0959
irintensity: 0.0432 0.0753 0.8567 0.4515 2.1204 2.0375 5.4128 3.6777 2.0009 1.5445 1.3891 0.8146 22.5025 0.3446 0.1370 5.2879 2.4289 7.1707 26.8008 0.0513 2.1709 15.4679 10.4124 19.8044 3.1420 9.5428 0.2738 10.5817 11.9954 6.8659 15.4655 52.2424 34.7216 5.7317 1.1909 75.5703 24.3060 1.8046 17.8224 112.7871 0.2969 36.4273 20.5756 2.1139 12.6479 34.9322 15.6907 32.2118 8.0906 52.9703 88.9273 7.0824 135.8080 12.1438 2.4921 2.8364 12.3348 31.6508 0.6186 283.3426 140.3220 32.7553 5.6294 10.4002 1.0432 28.3338 26.7384 19.8920 2.5985 16.8554 63.0343 1.6944 22.2124 22.7472 15.1753 9.7830 116.8260 341.9209 55.6535 75.4112 46.9820 53.7371 209.9970 17.7970 67.1518 45.1678 40.1751 42.6145 22.7569 30.8242 29.4091 15.8713 0.3227 2.3863 4.5973 19.4301
temp: 298.150 k
press: 1.00000 atm
elementType: 17 8 7 7 7 6 6 6 6 6 6 6 6 6 6 6 6 6 1 1 1 1 1 1 1 1 1 1 1 1 1 1 1 1
symmnumber: 1
zpe: 711448.8 jmol-1
zpe.correction: 0.270977 hartree
zpe.thermalcorrener: 0.288115 hartree
zpe.thermalcorrenthalpy: 0.289059 hartree
zpe.thermalcorrgfe: 0.223286 hartree
zpe.sumelectzpe: -1203.128185 hartree
zpe.sumelectthermal: -1203.111046 hartree
zpe.sumelectthermalent: -1203.110102 hartree
zpe.sumelectthermalfe: -1203.175876 hartree
dipole: -7.0337 -2.6847 0.3507
dipole: 7.5368
quadrupole: -100.0079 -119.1443 -116.8641
quadrupole: 2.9673 -3.3070 0.1019
quadrupole: 11.9975 -7.1388 -4.8587 2.9673 -3.3070 0.1019
hfenergy: -1203.3991615 hartree
pointgroup: C01 [X(C13H16Cl1N3O1)]
dipole: 2.8886246 0.4123893 0.5275078 debye
polarizability: 299.6022266|25.9628126|105.0012573|-22.547721|28.5171515|184.3961189 unknown
InChI: InChI=1S/C13H16ClN3O/c1-16-6-8-17(9-7-16)15-10-13(18)11-2-4-12(14)5-3-11/h2-5,10H,6-9H2,1H3
charge 0 multiplicity 1
34 atoms
Cl -5.534779 0.165843 2.91047
O  -1.819043 -1.041958 -2.663887
N  4.855134 0.868526 -0.126477
N  2.049571 0.386734 -0.426248
N  0.707187 0.189974 -0.440021
C  3.981239 0.830294 1.068813
C  4.378131 -0.105265 -1.13214
C  2.549041 1.23002 0.680543
C  2.94752 0.232097 -1.596569
C  6.283562 0.688551 0.202536
C  0.077696 -0.301556 -1.50394
C  -1.371292 -0.584541 -1.55232
C  -2.329941 -0.370966 -0.406936
C  -1.966668 0.124573 0.875378
C  -3.693361 -0.697416 -0.652316
C  -2.939072 0.289399 1.885423
C  -4.67421 -0.538865 0.34518
C  -4.277301 -0.045253 1.604532
H  4.361658 1.549876 1.816224
H  3.971222 -0.185428 1.541521
H  4.389789 -1.151605 -0.730833
H  5.047992 -0.073533 -2.010744
H  1.855386 1.106768 1.527804
H  2.544536 2.295287 0.368289
H  2.951267 1.168103 -2.193835
H  2.579848 -0.589039 -2.235545
H  6.511941 -0.307126 0.65853
H  6.600513 1.472133 0.913136
H  6.891464 0.793701 -0.713476
H  0.572801 -0.540397 -2.459047
H  -0.92339 0.378581 1.071566
H  -3.958876 -1.077299 -1.644185
H  -2.661297 0.670978 2.872279
H  -5.720667 -0.791491 0.151994
