program: Gaussian 09
title: 000033066
version: EM64L-G09RevD.01
frameworkgroup: C1[X(C14H18N2O2)]
method: RPBEPBE
basis: SDD
operation: Freq
keyword: #p
keyword: freq=noraman
keyword: PBEPBE/SDD
title: #p freq=noraman PBEPBE/SDD
converged: YES YES NO NO
title: Mulliken charges:
elementType: O O N N C C C C C C C C C C C C C C H H H H H H H H H H H H H H H H H H
charge: -0.260688 -0.259627 -0.091218 0.013177 -0.403174 -0.388260 -0.379260 -0.374578 -0.361524 -0.367661 0.069829 0.273658 -0.320767 -0.336963 0.323803 -0.364546 -0.361659 -0.537173 0.198736 0.225386 0.212841 0.208557 0.205349 0.210344 0.229437 0.225054 0.208657 0.239195 0.222329 0.284466 0.280260 0.235287 0.250292 0.245725 0.222436 0.222279
chargesum: 0.00000
title: Mulliken charges with hydrogens summed into heavy atoms:
elementType: O O N N C C C C C C C C C C C C C C
charge: -0.260688 -0.259627 -0.091218 0.013177 0.020948 0.033138 0.036434 0.079914 0.086328 -0.145332 0.069829 0.273658 -0.036301 -0.056703 0.323803 -0.129259 -0.111367 0.153266
polarizability: 2.93574917e+02 6.57021574e-01 1.99111418e+02 -2.12018639e+00 -8.33890376e-01 9.56188010e+01
1716.lowfreq: -13.8711 -8.2679 -4.7894 -0.0003 0.0004 0.0008 12.4778 29.4940 43.7870
frequency: 10.8972 29.4619 43.7733 57.6846 74.6043 132.5209 138.3302 159.9707 191.8709 204.6147 224.6962 242.0494 258.6673 294.8291 316.7101 342.8010 355.2872 389.0349 415.9294 440.3998 449.3900 473.1194 505.9246 529.2480 572.9625 614.6856 637.7768 676.4856 699.8006 758.1961 762.0831 791.1903 803.3943 824.3754 848.9217 851.1853 856.5946 895.2053 918.5738 948.8199 979.7525 984.7452 991.1610 999.7980 1001.7042 1044.6729 1076.9687 1089.5307 1103.6641 1109.5385 1111.0483 1123.2059 1151.5788 1154.4345 1169.2735 1181.6214 1230.2293 1243.3676 1258.1340 1267.8072 1294.9256 1296.8932 1306.4265 1331.5118 1340.9049 1347.2358 1350.8118 1360.8063 1370.8186 1378.7085 1425.4374 1434.8176 1457.0894 1463.0182 1465.3662 1466.3231 1466.9581 1473.0423 1476.4821 1495.3531 1499.1923 1536.4073 1576.8091 1616.1530 2922.1690 2928.9472 2961.6784 2973.5966 2991.4118 2991.6326 3043.8835 3049.1016 3050.5856 3053.7271 3059.5887 3064.0357 3081.0617 3126.5282 3149.4878 3150.5368 3169.5754 3177.2090
redmass: 3.2538 3.4772 3.9000 4.4691 4.0181 4.9140 4.2311 3.6922 3.5541 2.3951 1.2194 2.5875 3.7570 3.4056 5.0479 2.2051 3.2174 4.5723 3.0117 3.0379 3.6115 3.7128 2.9445 3.1501 3.9530 4.6167 5.5683 3.6876 4.3274 4.3461 4.2227 2.3813 2.2775 1.2980 1.5074 2.3840 1.5957 1.6363 2.3438 1.3135 1.3697 7.8140 2.8431 1.3654 2.7929 2.0010 2.9192 1.4490 1.9589 1.4084 1.2604 2.3175 1.3392 1.3332 1.8593 1.4574 3.1240 2.0959 1.2952 1.2649 1.6457 1.3005 2.0462 1.2758 1.3917 1.4559 1.6199 1.5377 2.9844 2.6295 4.2161 1.1847 1.0896 1.0969 1.0820 1.0506 1.0875 1.0818 1.0953 2.4860 8.2034 5.2288 7.4658 6.3598 1.0705 1.0693 1.0328 1.0644 1.0620 1.0606 1.0962 1.0934 1.1039 1.0986 1.0974 1.0934 1.0918 1.0996 1.0879 1.0884 1.0965 1.0953
irintensity: 0.8267 0.5826 1.5998 0.4091 0.2922 6.3929 1.2862 2.1785 1.0113 1.9919 0.4689 11.7570 10.1575 4.3284 2.5426 3.8199 4.4608 27.9524 0.1500 0.1818 1.2226 1.8814 10.7630 5.2570 19.3750 29.8639 12.6798 9.9571 10.6731 3.8877 9.4710 13.7011 33.5992 10.9070 45.7676 0.6702 77.1511 25.0038 9.1612 4.3549 1.3421 56.8056 66.7408 0.7849 3.0078 5.6931 83.2551 30.2511 57.1674 43.1199 0.2449 7.5253 22.0788 7.2901 166.9726 79.7129 163.0400 1.2445 19.1963 13.9916 31.5324 37.0271 392.6128 14.0707 2.4035 0.6154 17.0968 16.4583 4.9330 37.9723 50.4831 3.8748 7.6703 49.2006 10.7834 15.3698 22.9985 42.2642 5.4409 46.8782 153.7049 283.9875 70.9303 173.5841 44.3430 69.1392 68.2315 40.2765 27.9161 32.7543 72.5422 11.3961 47.3878 33.7467 62.1754 49.1125 19.9926 27.3685 1.3370 7.1750 8.6924 20.3867
temp: 298.150 k
press: 1.00000 atm
elementType: 8 8 7 7 6 6 6 6 6 6 6 6 6 6 6 6 6 6 1 1 1 1 1 1 1 1 1 1 1 1 1 1 1 1 1 1
symmnumber: 1
zpe: 778712.4 jmol-1
zpe.correction: 0.296596 hartree
zpe.thermalcorrener: 0.313765 hartree
zpe.thermalcorrenthalpy: 0.314709 hartree
zpe.thermalcorrgfe: 0.249111 hartree
zpe.sumelectzpe: -802.845060 hartree
zpe.sumelectthermal: -802.827891 hartree
zpe.sumelectthermalent: -802.826947 hartree
zpe.sumelectthermalfe: -802.892544 hartree
dipole: -4.5691 -5.9740 0.2362
dipole: 7.5247
quadrupole: -82.7780 -108.4946 -109.2310
quadrupole: -10.2511 -1.1696 -0.0972
quadrupole: 17.3899 -8.3267 -9.0632 -10.2511 -1.1696 -0.0972
hfenergy: -803.141656 hartree
pointgroup: C01 [X(C14H18N2O2)]
dipole: -1.9006987 -1.651043 -1.5574794 debye
polarizability: 291.6786017|11.3773723|140.3774471|-15.1556103|50.3562428|156.2490873 unknown
InChI: InChI=1S/C14H18N2O2/c1-18-13-7-5-12(6-8-13)14(17)11-15-16-9-3-2-4-10-16/h5-8,11H,2-4,9-10H2,1H3
charge 0 multiplicity 1
36 atoms
O  0.670853 1.902768 2.640047
O  5.094619 -0.757194 -1.131733
N  -2.73064 -0.443889 0.411732
N  -1.406232 -0.181773 0.59411
C  -5.487315 -1.198367 -0.183415
C  -5.156525 0.148823 0.495435
C  -4.327512 -1.610259 -1.117848
C  -3.817311 0.097493 1.265955
C  -3.005262 -1.694947 -0.331523
C  -0.978344 0.70502 1.486387
C  0.444104 1.065334 1.692756
C  1.591983 0.52605 0.8910
C  1.470635 -0.363117 -0.209667
C  2.899792 0.954561 1.270402
C  3.897256 -0.37618 -0.513076
C  2.608889 -0.813999 -0.911216
C  4.038095 0.51393 0.584484
C  5.011544 -1.675221 -2.270951
H  -5.639442 -1.980883 0.588545
H  -6.432958 -1.117241 -0.750428
H  -5.093776 0.940534 -0.275915
H  -5.955546 0.44114 1.202472
H  -4.527695 -2.591815 -1.586804
H  -4.224366 -0.866108 -1.931288
H  -3.544841 1.117477 1.586768
H  -3.918206 -0.52622 2.182952
H  -3.056306 -2.547096 0.384053
H  -2.142158 -1.866461 -0.994743
H  -1.637513 1.253326 2.179099
H  0.475504 -0.698556 -0.509211
H  2.984047 1.642688 2.117796
H  2.482288 -1.497258 -1.756661
H  5.043131 0.8381 0.871057
H  6.052519 -1.832911 -2.588728
H  4.429695 -1.232208 -3.102344
H  4.559998 -2.642139 -1.9757
