program: Gaussian 09
title: 000033175
version: EM64L-G09RevD.01
frameworkgroup: C1[X(C18H20N2O3)]
method: RPBEPBE
basis: SDD
operation: Freq
keyword: #p
keyword: freq=noraman
keyword: PBEPBE/SDD
title: #p freq=noraman PBEPBE/SDD
converged: YES YES NO NO
title: Mulliken charges:
elementType: O O O N N C C C C C C C C C C C C C C C C C C H H H H H H H H H H H H H H H H H H H H
charge: -0.459067 -0.280097 -0.188599 -0.376243 -0.394023 -0.082025 -0.566925 -0.487870 0.199013 0.428433 0.178094 -0.514771 0.477512 -0.362801 -0.452317 -0.375820 -0.443271 -0.223065 -0.219586 -0.240881 -0.228854 -0.218097 -0.243198 0.238494 0.238476 0.277332 0.270621 0.231329 0.204862 0.224157 0.269882 0.372613 0.274027 0.231918 0.246877 0.232989 0.226736 0.225564 0.228348 0.392911 0.229149 0.227505 0.230666
chargesum: 0.00000
title: Mulliken charges with hydrogens summed into heavy atoms:
elementType: O O O N N C C C C C C C C C C C C C C C C C C
charge: -0.066156 -0.280097 -0.188599 -0.105622 -0.021410 0.156469 -0.051117 -0.051679 0.199013 0.428433 0.178094 -0.020731 0.477512 -0.088775 -0.220399 -0.128943 -0.210281 0.003671 0.005978 -0.012533 0.000294 0.009408 -0.012532
polarizability: 2.82520682e+02 2.81153893e+01 1.65572189e+02 -2.13163258e+01 1.23497897e+01 1.89961365e+02
1716.lowfreq: -15.3713 -8.8287 -4.5481 -2.2931 0.0003 0.0007 0.0011 7.4822 19.8692
frequency: -10.9856 3.3479 19.2675 23.9860 27.8120 39.6069 54.1581 56.2908 85.2779 104.6934 134.7755 182.6707 187.1863 206.7068 226.0788 257.9344 269.5148 287.0646 301.2601 356.2565 379.8293 403.1916 406.0760 437.4023 459.8639 471.2133 496.8813 523.5013 548.6269 581.0496 587.4159 615.0208 616.6815 618.3159 639.4067 667.1022 704.5361 704.9492 711.1348 748.7753 751.9624 759.4495 778.7991 805.6178 817.5548 856.7504 858.0655 875.8972 916.6104 918.4400 960.6873 971.8012 978.8273 981.2317 989.9159 990.2031 996.1740 998.0100 1008.0338 1013.5634 1025.2416 1026.4093 1041.7674 1071.4461 1081.6226 1089.2113 1099.1422 1163.5846 1171.3432 1172.2717 1183.1032 1187.0145 1192.0870 1206.6196 1214.1329 1220.8360 1228.4605 1232.1828 1273.1867 1288.5685 1305.4200 1316.9142 1320.0638 1350.3625 1353.2885 1362.3830 1385.7160 1388.4050 1438.1594 1440.8999 1441.2335 1463.1995 1472.9940 1478.1543 1485.5260 1486.5555 1542.8578 1594.3686 1594.5992 1606.0978 1614.4414 1615.1159 1690.8471 2879.7023 2884.4367 2979.3761 2981.9956 3004.3341 3039.4578 3061.1769 3115.5545 3116.3424 3123.2707 3125.9452 3135.4291 3138.6871 3146.1127 3150.6975 3163.4633 3163.8903 3432.1034 3503.3183 3521.0809
redmass: 4.5333 5.4571 5.8478 4.1702 4.7687 5.8370 5.6300 6.3349 4.8943 4.1705 4.8854 3.7945 4.0453 2.9145 5.7749 4.3940 4.1771 3.3550 4.9016 2.9262 3.3438 2.8107 2.8321 3.4347 3.1272 2.9147 2.7006 2.5040 2.7676 4.2883 2.4698 6.2959 5.8396 2.4097 2.7386 3.5866 2.1286 1.8731 3.3901 1.6373 1.5864 1.3967 3.1142 3.8954 3.8009 1.2536 1.2460 3.0561 1.3982 1.3719 2.5222 2.0216 1.3985 1.3897 5.9100 6.1036 1.3450 1.3527 2.3915 2.7870 2.2312 2.1703 3.2465 3.3506 1.6050 1.8774 3.0061 3.0850 1.0574 1.0540 1.1090 1.1119 1.2904 1.3298 2.6030 1.9795 1.5049 1.2508 1.3861 1.7444 1.3909 1.4131 1.3450 1.4504 1.5358 1.5472 5.6937 4.6052 1.0820 2.1311 2.1294 1.2731 1.2556 1.4477 1.8116 1.5123 1.7513 5.9120 6.1533 4.7616 5.9166 6.0539 8.4512 1.0722 1.0794 1.0878 1.0611 1.0605 1.0999 1.1001 1.0868 1.0870 1.0863 1.0867 1.0913 1.0919 1.0961 1.0958 1.1015 1.1014 1.0814 1.0761 1.0643
irintensity: 0.1010 0.6661 1.4235 0.4963 1.1797 3.8046 1.1919 2.4662 0.6288 0.6024 1.0013 4.0290 0.2410 8.6129 8.0057 5.3406 1.7400 0.7484 2.6048 23.6983 2.7805 0.4078 0.3311 7.4105 6.6731 42.3762 34.0895 24.8427 30.5288 3.7228 24.5859 0.2235 3.5758 69.4691 40.6201 22.9380 60.9916 44.6297 4.9257 69.3140 91.2913 46.8527 12.5194 12.1560 5.3024 0.5974 0.0184 4.5179 8.2599 1.3582 25.0385 71.0026 0.3043 1.2123 1.8366 0.9590 0.8187 5.7872 28.7222 207.7679 13.0691 6.8855 11.3353 3.8046 10.7781 23.9348 8.6985 36.4694 0.3297 0.0976 2.0360 1.2069 3.0245 9.1059 0.8476 21.1000 17.8987 44.6978 20.0501 69.2602 16.7407 26.0735 4.2557 13.5346 4.7683 11.0062 1.8631 0.4946 21.6527 7.6620 15.9274 40.6930 31.4723 31.9062 4.6941 2.0753 270.2942 2.3390 0.7261 213.9734 13.6931 3.2454 176.4812 50.0993 99.4465 21.8266 44.1752 8.3397 15.2350 6.3977 7.9701 7.8985 1.4446 0.6354 12.6266 23.4654 40.4832 28.8261 22.9681 22.0885 207.3445 3.8069 35.9691
temp: 298.150 k
press: 1.00000 atm
elementType: 8 8 8 7 7 6 6 6 6 6 6 6 6 6 6 6 6 6 6 6 6 6 6 1 1 1 1 1 1 1 1 1 1 1 1 1 1 1 1 1 1 1 1
symmnumber: 1
zpe: 908890.7 jmol-1
zpe.correction: 0.346178 hartree
zpe.thermalcorrener: 0.367141 hartree
zpe.thermalcorrenthalpy: 0.368085 hartree
zpe.thermalcorrgfe: 0.290409 hartree
zpe.sumelectzpe: -1031.425255 hartree
zpe.sumelectthermal: -1031.404293 hartree
zpe.sumelectthermalent: -1031.403348 hartree
zpe.sumelectthermalfe: -1031.481024 hartree
dipole: -0.0587 -2.4556 3.2754
dipole: 4.0941
quadrupole: -121.9327 -146.5544 -130.3284
quadrupole: 16.5195 -3.7083 6.1025
quadrupole: 11.0058 -13.6159 2.6101 16.5195 -3.7083 6.1025
hfenergy: -1031.7714333 hartree
pointgroup: C01 [X(C18H20N2O3)]
dipole: 0.0315285 1.3831803 -0.8248207 debye
polarizability: 279.4625203|-39.2415111|163.5775031|8.5123685|0.0547938|195.014213 unknown
InChI: InChI=1S/C18H20N2O3/c21-17(20-13-15-9-5-2-6-10-15)11-16(18(22)23)19-12-14-7-3-1-4-8-14/h1-10,16,19-20,22H,11-13H2
charge 0 multiplicity 1
43 atoms
O  -0.716686 1.59822 -0.250856
O  -1.895755 -3.059921 -0.284146
O  0.760718 1.239757 1.507905
N  2.198727 -0.517284 -0.302234
N  -2.19134 -0.821469 -0.851693
C  0.758639 -0.31723 -0.461029
C  0.027975 -1.614138 0.009664
C  3.094998 0.522336 -0.844434
C  -1.433618 -1.880027 -0.394895
C  4.542186 0.262923 -0.444788
C  0.325281 0.88705 0.399839
C  -3.608351 -0.988234 -1.22355
C  -4.5213 -0.009656 -0.491684
C  4.86262 -0.035691 0.904936
C  5.584629 0.338727 -1.400167
C  -4.445134 0.131557 0.918545
C  -5.473611 0.759005 -1.204949
C  6.203917 -0.250418 1.289273
C  6.929601 0.127408 -1.015726
C  7.242505 -0.168017 0.330516
C  -5.304618 1.021035 1.599231
C  -6.338124 1.648753 -0.525704
C  -6.255169 1.783725 0.878695
H  0.45444 -0.086268 -1.510858
H  0.588359 -2.479062 -0.393476
H  0.101555 -1.695301 1.110403
H  2.509013 -1.473591 -0.499203
H  2.771183 1.495255 -0.42042
H  3.024743 0.620151 -1.95504
H  -3.729585 -0.866264 -2.317755
H  -3.863603 -2.036509 -0.977408
H  -1.801886 0.129447 -0.86508
H  4.04876 -0.099873 1.635584
H  5.345399 0.562701 -2.447523
H  -3.714629 -0.464149 1.478888
H  -5.539888 0.661385 -2.295973
H  6.441829 -0.4784 2.334583
H  7.727823 0.188689 -1.764149
H  8.283459 -0.334501 0.629979
H  -1.040876 2.338055 0.33042
H  -5.239922 1.115709 2.689189
H  -7.070984 2.235781 -1.090717
H  -6.923479 2.473135 1.40661
