program: Gaussian 09
title: 000033084
version: EM64L-G09RevD.01
frameworkgroup: C1[X(C14H19N3O2)]
method: RPBEPBE
basis: SDD
operation: Freq
keyword: #p
keyword: freq=noraman
keyword: PBEPBE/SDD
title: #p freq=noraman PBEPBE/SDD
converged: YES YES NO NO
title: Mulliken charges:
elementType: O O N N N C C C C C C C C C C C C C C H H H H H H H H H H H H H H H H H H H
charge: -0.259618 -0.259358 -0.073276 -0.103078 0.017575 -0.361314 -0.372728 -0.350260 -0.356127 -0.614525 -0.365502 0.067802 0.274132 -0.320821 -0.336438 0.323730 -0.364357 -0.361436 -0.537076 0.216150 0.195529 0.195316 0.220676 0.229531 0.224791 0.237870 0.221234 0.192596 0.227088 0.227620 0.222126 0.285132 0.280368 0.235407 0.250495 0.245883 0.222533 0.222333
chargesum: 0.00000
title: Mulliken charges with hydrogens summed into heavy atoms:
elementType: O O N N N C C C C C C C C C C C C C C
charge: -0.259618 -0.259358 -0.073276 -0.103078 0.017575 0.050364 0.043264 0.104062 0.102977 0.032779 -0.143376 0.067802 0.274132 -0.035690 -0.056070 0.323730 -0.128950 -0.110942 0.153673
polarizability: 3.10110942e+02 -1.52642459e+00 2.06892462e+02 3.61421858e+00 2.70023590e+00 1.00133828e+02
1716.lowfreq: -7.2144 -6.4375 -0.0009 -0.0005 -0.0003 2.8490 16.3506 26.2962 42.0877
frequency: 15.9615 26.2647 42.0657 51.2740 74.3870 128.4484 135.3418 142.5553 183.1809 189.4582 205.4827 225.3848 238.9827 258.4657 267.2854 293.4198 311.7768 339.4555 351.2326 380.1428 393.1252 416.4578 450.5227 470.8190 484.5093 507.1546 548.1062 589.0792 624.1874 643.5810 677.3378 701.5194 750.6443 761.6055 780.9834 798.1595 824.9092 838.8344 857.2206 897.0810 937.3069 982.5150 984.8153 991.2995 1000.4459 1001.7647 1024.9580 1048.7615 1069.8924 1072.9038 1084.5145 1109.7691 1110.5259 1117.8489 1148.0349 1154.4638 1158.1898 1161.7347 1182.3057 1197.6466 1230.7164 1242.3332 1279.0233 1288.2118 1297.2366 1303.3645 1308.3094 1338.6318 1348.7909 1364.5397 1369.4775 1374.8008 1382.2517 1426.5912 1433.8277 1435.2177 1452.3018 1456.4995 1458.2028 1464.0186 1466.7665 1472.8191 1475.6397 1482.4385 1496.1532 1499.3776 1537.6703 1577.2753 1616.7377 2848.3257 2855.1526 2873.6616 2954.7138 2958.8939 2961.8358 3025.4883 3037.4646 3043.0241 3050.9972 3053.6676 3064.9364 3082.7743 3087.3224 3126.1283 3150.0258 3150.9898 3170.1106 3177.3475
redmass: 3.0997 3.7114 4.0923 4.7937 4.0891 4.7989 4.4255 3.9335 4.9276 3.3094 1.4961 1.1865 1.3918 3.4892 2.6686 3.3571 4.4234 2.8841 4.0015 2.1013 4.1545 3.0182 5.6380 3.6124 3.3113 2.9696 5.1738 4.0375 4.2501 3.7905 3.6828 4.4442 3.9751 4.0479 3.7419 4.9686 1.2971 1.5646 1.5904 1.6247 1.9901 1.3760 7.4781 2.6072 1.3772 2.7880 2.4147 1.6633 1.7667 1.9099 2.7222 1.3265 1.2701 1.4960 2.5858 1.3651 2.5231 2.3354 1.3272 1.0754 3.1677 3.2387 1.6191 1.5530 1.4037 1.9616 1.4387 1.2842 1.4241 1.3735 2.8383 2.5969 1.8180 4.2499 1.1710 1.1778 1.0870 1.0771 1.1000 1.0594 1.0504 1.0808 1.1051 1.0523 2.5024 8.1711 5.3159 7.4077 6.3584 1.0713 1.0669 1.0589 1.0662 1.0676 1.0330 1.0741 1.0881 1.0901 1.1040 1.0904 1.0905 1.1011 1.0937 1.0996 1.0880 1.0885 1.0965 1.0954
irintensity: 1.0659 0.0753 0.9228 1.1955 0.2481 5.1333 2.9120 5.9710 0.2709 4.2396 1.9731 0.0145 1.9946 8.2170 25.5453 1.3391 3.3638 2.8786 1.7019 2.3019 29.0498 0.0841 0.1925 0.2284 4.5114 10.6463 7.5435 27.0429 13.6904 23.9889 9.0681 14.9389 9.7129 5.7214 4.2284 47.4651 11.5013 5.9562 76.6069 26.1219 1.5081 2.6065 60.9858 119.4922 0.4773 2.9491 22.6672 2.2319 7.4283 21.0069 37.9984 7.5210 1.3826 80.9797 111.2380 33.9719 69.6175 74.1213 114.3832 2.0362 163.5836 6.5071 10.9681 24.6429 90.5645 194.9177 188.4730 26.9274 11.6952 11.8900 13.9241 19.5617 22.3666 50.3380 1.6317 5.3761 17.3525 0.0705 68.1044 17.8088 13.4278 40.5596 14.8050 9.0023 44.6232 158.1483 294.8300 72.7187 174.9286 48.6606 50.0803 216.1265 21.1454 73.9800 69.3653 45.7775 42.6902 46.4045 47.5968 27.6223 32.8574 30.2067 16.8527 27.3819 1.5853 6.8236 8.3842 21.3881
temp: 298.150 k
press: 1.00000 atm
elementType: 8 8 7 7 7 6 6 6 6 6 6 6 6 6 6 6 6 6 6 1 1 1 1 1 1 1 1 1 1 1 1 1 1 1 1 1 1 1
symmnumber: 1
zpe: 819251.7 jmol-1
zpe.correction: 0.312036 hartree
zpe.thermalcorrener: 0.330561 hartree
zpe.thermalcorrenthalpy: 0.331506 hartree
zpe.thermalcorrgfe: 0.263333 hartree
zpe.sumelectzpe: -858.090495 hartree
zpe.sumelectthermal: -858.071970 hartree
zpe.sumelectthermalent: -858.071026 hartree
zpe.sumelectthermalfe: -858.139198 hartree
dipole: -4.7857 -5.7947 0.3221
dipole: 7.5223
quadrupole: -91.3563 -112.0003 -116.9728
quadrupole: -13.5823 -3.4310 -0.0265
quadrupole: 15.4202 -5.2238 -10.1964 -13.5823 -3.4310 -0.0265
hfenergy: -858.4025312 hartree
pointgroup: C01 [X(C14H19N3O2)]
dipole: 1.9914574 1.5099433 1.5851852 debye
polarizability: 308.3546215|8.1506378|153.7461893|-16.6934707|52.907814|155.036422 unknown
InChI: InChI=1S/C14H19N3O2/c1-16-7-9-17(10-8-16)15-11-14(18)12-3-5-13(19-2)6-4-12/h3-6,11H,7-10H2,1-2H3
charge 0 multiplicity 1
38 atoms
O  -1.170015 -2.092411 -2.513711
O  -5.38573 0.967068 1.19203
N  5.129048 0.969378 -0.175434
N  2.378372 0.272573 -0.562723
N  1.039892 0.047346 -0.673616
C  4.110959 1.389824 0.815481
C  4.773396 -0.351508 -0.738979
C  2.741524 1.524842 0.1319
C  3.410685 -0.303222 -1.457259
C  6.501483 0.999507 0.368151
C  0.549354 -0.855432 -1.515714
C  -0.888298 -1.192596 -1.641553
C  -1.99175 -0.563987 -0.842723
C  -1.813686 0.445828 0.139832
C  -3.317519 -1.024196 -1.104167
C  -4.221724 0.509861 0.561941
C  -2.914591 0.983389 0.840013
C  -4.418813 -0.500435 -0.416519
C  -5.245197 2.011021 2.210726
H  4.400704 2.370801 1.23409
H  4.033252 0.66105 1.663022
H  4.734278 -1.140796 0.055938
H  5.54594 -0.649502 -1.471383
H  1.947322 1.736622 0.865959
H  2.784247 2.361217 -0.597648
H  3.487709 0.302585 -2.385298
H  3.122527 -1.331621 -1.735407
H  6.65713 0.290191 1.219423
H  6.73623 2.018436 0.723632
H  7.22219 0.742493 -0.428314
H  1.165439 -1.448351 -2.211537
H  -0.804352 0.806029 0.349701
H  -3.446084 -1.802506 -1.863359
H  -2.744071 1.761065 1.590845
H  -5.437317 -0.849216 -0.612211
H  -6.268482 2.20849 2.562026
H  -4.812417 2.93548 1.781731
H  -4.619734 1.66548 3.056515
